Cirrus CI / macOS-cross, gui, no tests
failed
May 23, 2025 in 1m 26s
Task Summary
Instruction ci failed in 01:19
Details
✅ 00:02 clone
✅ 00:01 merge_base
❌ 01:19 ci
[18:31:38.364] cd /ci_container_base/ci/scratch/build-x86_64-apple-darwin/src && /usr/bin/cmake -DBUILD_INFO_HEADER_PATH=/ci_container_base/ci/scratch/build-x86_64-apple-darwin/src/bitcoin-build-info.h -DSOURCE_DIR=/ci_container_base -P /ci_container_base/cmake/script/GenerateBuildInfo.cmake
[18:31:38.463] gmake[2]: Leaving directory '/ci_container_base/ci/scratch/build-x86_64-apple-darwin'
[18:31:38.484] [ 0%] Built target generate_build_info
[18:31:38.485] /usr/bin/gmake -f src/wallet/CMakeFiles/bitcoin_wallet.dir/build.make src/wallet/CMakeFiles/bitcoin_wallet.dir/depend
[18:31:38.492] gmake[2]: Entering directory '/ci_container_base/ci/scratch/build-x86_64-apple-darwin'
[18:31:38.492] cd /ci_container_base/ci/scratch/build-x86_64-apple-darwin && /usr/bin/cmake -E cmake_depends "Unix Makefiles" /ci_container_base /ci_container_base/src/wallet /ci_container_base/ci/scratch/build-x86_64-apple-darwin /ci_container_base/ci/scratch/build-x86_64-apple-darwin/src/wallet /ci_container_base/ci/scratch/build-x86_64-apple-darwin/src/wallet/CMakeFiles/bitcoin_wallet.dir/DependInfo.cmake "--color="
[18:31:38.506] Dependencies file "src/wallet/CMakeFiles/bitcoin_wallet.dir/coincontrol.cpp.o.d" is newer than depends file "/ci_container_base/ci/scratch/build-x86_64-apple-darwin/src/wallet/CMakeFiles/bitcoin_wallet.dir/compiler_depend.internal".
[18:31:38.508] Dependencies file "src/wallet/CMakeFiles/bitcoin_wallet.dir/coinselection.cpp.o.d" is newer than depends file "/ci_container_base/ci/scratch/build-x86_64-apple-darwin/src/wallet/CMakeFiles/bitcoin_wallet.dir/compiler_depend.internal".
[18:31:38.510] Dependencies file "src/wallet/CMakeFiles/bitcoin_wallet.dir/context.cpp.o.d" is newer than depends file "/ci_container_base/ci/scratch/build-x86_64-apple-darwin/src/wallet/CMakeFiles/bitcoin_wallet.dir/compiler_depend.internal".
[18:31:38.511] Dependencies file "src/wallet/CMakeFiles/bitcoin_wallet.dir/crypter.cpp.o.d" is newer than depends file "/ci_container_base/ci/scratch/build-x86_64-apple-darwin/src/wallet/CMakeFiles/bitcoin_wallet.dir/compiler_depend.internal".
[18:31:38.513] Dependencies file "src/wallet/CMakeFiles/bitcoin_wallet.dir/db.cpp.o.d" is newer than depends file "/ci_container_base/ci/scratch/build-x86_64-apple-darwin/src/wallet/CMakeFiles/bitcoin_wallet.dir/compiler_depend.internal".
[18:31:38.515] Dependencies file "src/wallet/CMakeFiles/bitcoin_wallet.dir/dump.cpp.o.d" is newer than depends file "/ci_container_base/ci/scratch/build-x86_64-apple-darwin/src/wallet/CMakeFiles/bitcoin_wallet.dir/compiler_depend.internal".
[18:31:38.518] Dependencies file "src/wallet/CMakeFiles/bitcoin_wallet.dir/external_signer_scriptpubkeyman.cpp.o.d" is newer than depends file "/ci_container_base/ci/scratch/build-x86_64-apple-darwin/src/wallet/CMakeFiles/bitcoin_wallet.dir/compiler_depend.internal".
[18:31:38.521] Dependencies file "src/wallet/CMakeFiles/bitcoin_wallet.dir/feebumper.cpp.o.d" is newer than depends file "/ci_container_base/ci/scratch/build-x86_64-apple-darwin/src/wallet/CMakeFiles/bitcoin_wallet.dir/compiler_depend.internal".
[18:31:38.524] Dependencies file "src/wallet/CMakeFiles/bitcoin_wallet.dir/fees.cpp.o.d" is newer than depends file "/ci_container_base/ci/scratch/build-x86_64-apple-darwin/src/wallet/CMakeFiles/bitcoin_wallet.dir/compiler_depend.internal".
[18:31:38.527] Dependencies file "src/wallet/CMakeFiles/bitcoin_wallet.dir/interfaces.cpp.o.d" is newer than depends file "/ci_container_base/ci/scratch/build-x86_64-apple-darwin/src/wallet/CMakeFiles/bitcoin_wallet.dir/compiler_depend.internal".
[18:31:38.530] Dependencies file "src/wallet/CMakeFiles/bitcoin_wallet.dir/load.cpp.o.d" is newer than depends file "/ci_container_base/ci/scratch/build-x86_64-apple-darwin/src/wallet/CMakeFiles/bitcoin_wallet.dir/compiler_depend.internal".
[18:31:38.533] Dependencies file "src/wallet/CMakeFiles/bitcoin_wallet.dir/migrate.cpp.o.d" is newer than depends file "/ci_container_base/ci/scratch/build-x86_64-apple-darwin/src/wallet/CMakeFiles/bitcoin_wallet.dir/compiler_depend.internal".
[18:31:38.534] Dependencies file "src/wallet/CMakeFiles/bitcoin_wallet.dir/receive.cpp.o.d" is newer than depends file "/ci_container_base/ci/scratch/build-x86_64-apple-darwin/src/wallet/CMakeFiles/bitcoin_wallet.dir/compiler_depend.internal".
[18:31:38.537] Dependencies file "src/wallet/CMakeFiles/bitcoin_wallet.dir/rpc/addresses.cpp.o.d" is newer than depends file "/ci_container_base/ci/scratch/build-x86_64-apple-darwin/src/wallet/CMakeFiles/bitcoin_wallet.dir/compiler_depend.internal".
[18:31:38.540] Dependencies file "src/wallet/CMakeFiles/bitcoin_wallet.dir/rpc/backup.cpp.o.d" is newer than depends file "/ci_container_base/ci/scratch/build-x86_64-apple-darwin/src/wallet/CMakeFiles/bitcoin_wallet.dir/compiler_depend.internal".
[18:31:38.543] Dependencies file "src/wallet/CMakeFiles/bitcoin_wallet.dir/rpc/coins.cpp.o.d" is newer than depends file "/ci_container_base/ci/scratch/build-x86_64-apple-darwin/src/wallet/CMakeFiles/bitcoin_wallet.dir/compiler_depend.internal".
[18:31:38.545] Dependencies file "src/wallet/CMakeFiles/bitcoin_wallet.dir/rpc/encrypt.cpp.o.d" is newer than depends file "/ci_container_base/ci/scratch/build-x86_64-apple-darwin/src/wallet/CMakeFiles/bitcoin_wallet.dir/compiler_depend.internal".
[18:31:38.548] Dependencies file "src/wallet/CMakeFiles/bitcoin_wallet.dir/rpc/signmessage.cpp.o.d" is newer than depends file "/ci_container_base/ci/scratch/build-x86_64-apple-darwin/src/wallet/CMakeFiles/bitcoin_wallet.dir/compiler_depend.internal".
[18:31:38.553] Dependencies file "src/wallet/CMakeFiles/bitcoin_wallet.dir/rpc/spend.cpp.o.d" is newer than depends file "/ci_container_base/ci/scratch/build-x86_64-apple-darwin/src/wallet/CMakeFiles/bitcoin_wallet.dir/compiler_depend.internal".
[18:31:38.556] Dependencies file "src/wallet/CMakeFiles/bitcoin_wallet.dir/rpc/transactions.cpp.o.d" is newer than depends file "/ci_container_base/ci/scratch/build-x86_64-apple-darwin/src/wallet/CMakeFiles/bitcoin_wallet.dir/compiler_depend.internal".
[18:31:38.559] Dependencies file "src/wallet/CMakeFiles/bitcoin_wallet.dir/rpc/util.cpp.o.d" is newer than depends file "/ci_container_base/ci/scratch/build-x86_64-apple-darwin/src/wallet/CMakeFiles/bitcoin_wallet.dir/compiler_depend.internal".
[18:31:38.562] Dependencies file "src/wallet/CMakeFiles/bitcoin_wallet.dir/rpc/wallet.cpp.o.d" is newer than depends file "/ci_container_base/ci/scratch/build-x86_64-apple-darwin/src/wallet/CMakeFiles/bitcoin_wallet.dir/compiler_depend.internal".
[18:31:38.565] Dependencies file "src/wallet/CMakeFiles/bitcoin_wallet.dir/scriptpubkeyman.cpp.o.d" is newer than depends file "/ci_container_base/ci/scratch/build-x86_64-apple-darwin/src/wallet/CMakeFiles/bitcoin_wallet.dir/compiler_depend.internal".
[18:31:38.568] Dependencies file "src/wallet/CMakeFiles/bitcoin_wallet.dir/spend.cpp.o.d" is newer than depends file "/ci_container_base/ci/scratch/build-x86_64-apple-darwin/src/wallet/CMakeFiles/bitcoin_wallet.dir/compiler_depend.internal".
[18:31:38.571] Dependencies file "src/wallet/CMakeFiles/bitcoin_wallet.dir/sqlite.cpp.o.d" is newer than depends file "/ci_container_base/ci/scratch/build-x86_64-apple-darwin/src/wallet/CMakeFiles/bitcoin_wallet.dir/compiler_depend.internal".
[18:31:38.573] Dependencies file "src/wallet/CMakeFiles/bitcoin_wallet.dir/transaction.cpp.o.d" is newer than depends file "/ci_container_base/ci/scratch/build-x86_64-apple-darwin/src/wallet/CMakeFiles/bitcoin_wallet.dir/compiler_depend.internal".
[18:31:38.574] Dependencies file "src/wallet/CMakeFiles/bitcoin_wallet.dir/wallet.cpp.o.d" is newer than depends file "/ci_container_base/ci/scratch/build-x86_64-apple-darwin/src/wallet/CMakeFiles/bitcoin_wallet.dir/compiler_depend.internal".
[18:31:38.577] Dependencies file "src/wallet/CMakeFiles/bitcoin_wallet.dir/walletdb.cpp.o.d" is newer than depends file "/ci_container_base/ci/scratch/build-x86_64-apple-darwin/src/wallet/CMakeFiles/bitcoin_wallet.dir/compiler_depend.internal".
[18:31:38.580] Dependencies file "src/wallet/CMakeFiles/bitcoin_wallet.dir/walletutil.cpp.o.d" is newer than depends file "/ci_container_base/ci/scratch/build-x86_64-apple-darwin/src/wallet/CMakeFiles/bitcoin_wallet.dir/compiler_depend.internal".
[18:31:39.171] Consolidate compiler generated dependencies of target bitcoin_wallet
[18:31:39.173] gmake[2]: Leaving directory '/ci_container_base/ci/scratch/build-x86_64-apple-darwin'
[18:31:39.174] /usr/bin/gmake -f src/wallet/CMakeFiles/bitcoin_wallet.dir/build.make src/wallet/CMakeFiles/bitcoin_wallet.dir/build
[18:31:39.264] gmake[2]: Entering directory '/ci_container_base/ci/scratch/build-x86_64-apple-darwin'
[18:31:39.286] [ 1%] Building CXX object src/wallet/CMakeFiles/bitcoin_wallet.dir/rpc/spend.cpp.o
[18:31:39.287] cd /ci_container_base/ci/scratch/build-x86_64-apple-darwin/src/wallet && /usr/bin/ccache /usr/bin/clang++ --target=x86_64-apple-darwin -isysroot/ci_container_base/depends/SDKs/Xcode-15.0-15A240d-extracted-SDK-with-libcxx-headers -nostdlibinc -iwithsysroot/usr/include/c++/v1 -iwithsysroot/usr/include -iframeworkwithsysroot/System/Library/Frameworks --target=x86_64-apple-darwin -DBOOST_MULTI_INDEX_DISABLE_SERIALIZATION -DOBJC_OLD_DISPATCH_PROTOTYPES=0 -I/ci_container_base/ci/scratch/build-x86_64-apple-darwin/src -I/ci_container_base/src -I/ci_container_base/src/univalue/include -isystem /ci_container_base/depends/x86_64-apple-darwin/include -pipe -std=c++20 -mmacos-version-min=13.0 -mlinker-version=711 -O2 -O2 -g -std=c++20 -fPIC -fvisibility=hidden -fdebug-prefix-map=/ci_container_base/src=. -fmacro-prefix-map=/ci_container_base/src=. -U_FORTIFY_SOURCE -D_FORTIFY_SOURCE=3 -Wstack-protector -fstack-protector-all -fcf-protection=full -Werror -Wall -Wextra -Wgnu -Wformat -Wformat-security -Wvla -Wshadow-field -Wthread-safety -Wloop-analysis -Wredundant-decls -Wunused-member-function -Wdate-time -Wconditional-uninitialized -Woverloaded-virtual -Wsuggest-override -Wimplicit-fallthrough -Wunreachable-code -Wdocumentation -Wself-assign -Wundef -Wno-unused-parameter -MD -MT src/wallet/CMakeFiles/bitcoin_wallet.dir/rpc/spend.cpp.o -MF CMakeFiles/bitcoin_wallet.dir/rpc/spend.cpp.o.d -o CMakeFiles/bitcoin_wallet.dir/rpc/spend.cpp.o -c /ci_container_base/src/wallet/rpc/spend.cpp
[18:31:49.457] /ci_container_base/src/wallet/rpc/spend.cpp:764:17: error: expected '}'
[18:31:49.457] 764 | {
[18:31:49.457] | ^
[18:31:49.457] /ci_container_base/src/wallet/rpc/spend.cpp:747:22: note: to match this '{'
[18:31:49.457] 747 | return RPCHelpMan{
[18:31:49.457] | ^
[18:31:49.457] 1 error generated.
[18:31:49.462] gmake[2]: *** [src/wallet/CMakeFiles/bitcoin_wallet.dir/build.make:328: src/wallet/CMakeFiles/bitcoin_wallet.dir/rpc/spend.cpp.o] Error 1
[18:31:49.462] gmake[2]: Leaving directory '/ci_container_base/ci/scratch/build-x86_64-apple-darwin'
[18:31:49.463] gmake[1]: *** [CMakeFiles/Makefile2:1312: src/wallet/CMakeFiles/bitcoin_wallet.dir/all] Error 2
[18:31:49.463] gmake[1]: Leaving directory '/ci_container_base/ci/scratch/build-x86_64-apple-darwin'
[18:31:49.464] gmake: *** [Makefile:146: all] Error 2
[18:31:49.468]
[18:31:51.324]
[18:31:51.324] Exit status: 2
Loading