Skip to content

test: Test listdescs with priv works even with missing priv keys

Cirrus CI / tidy failed May 12, 2025 in 4m 17s

Task Summary

Instruction ci failed in 04:02

Details

✅ 00:05 clone
✅ 00:01 merge_base
❌ 04:02 ci

[09:30:33.364] Dependencies file "src/test/fuzz/CMakeFiles/fuzz.dir/script.cpp.o.d" is newer than depends file "/ci_container_base/ci/scratch/build-x86_64-pc-linux-gnu/src/test/fuzz/CMakeFiles/fuzz.dir/compiler_depend.internal".
[09:30:33.364] Dependencies file "src/test/fuzz/CMakeFiles/fuzz.dir/script_assets_test_minimizer.cpp.o.d" is newer than depends file "/ci_container_base/ci/scratch/build-x86_64-pc-linux-gnu/src/test/fuzz/CMakeFiles/fuzz.dir/compiler_depend.internal".
[09:30:33.365] Dependencies file "src/test/fuzz/CMakeFiles/fuzz.dir/script_descriptor_cache.cpp.o.d" is newer than depends file "/ci_container_base/ci/scratch/build-x86_64-pc-linux-gnu/src/test/fuzz/CMakeFiles/fuzz.dir/compiler_depend.internal".
[09:30:33.366] Dependencies file "src/test/fuzz/CMakeFiles/fuzz.dir/script_flags.cpp.o.d" is newer than depends file "/ci_container_base/ci/scratch/build-x86_64-pc-linux-gnu/src/test/fuzz/CMakeFiles/fuzz.dir/compiler_depend.internal".
[09:30:33.367] Dependencies file "src/test/fuzz/CMakeFiles/fuzz.dir/script_format.cpp.o.d" is newer than depends file "/ci_container_base/ci/scratch/build-x86_64-pc-linux-gnu/src/test/fuzz/CMakeFiles/fuzz.dir/compiler_depend.internal".
[09:30:33.368] Dependencies file "src/test/fuzz/CMakeFiles/fuzz.dir/script_interpreter.cpp.o.d" is newer than depends file "/ci_container_base/ci/scratch/build-x86_64-pc-linux-gnu/src/test/fuzz/CMakeFiles/fuzz.dir/compiler_depend.internal".
[09:30:33.369] Dependencies file "src/test/fuzz/CMakeFiles/fuzz.dir/script_ops.cpp.o.d" is newer than depends file "/ci_container_base/ci/scratch/build-x86_64-pc-linux-gnu/src/test/fuzz/CMakeFiles/fuzz.dir/compiler_depend.internal".
[09:30:33.369] Dependencies file "src/test/fuzz/CMakeFiles/fuzz.dir/script_parsing.cpp.o.d" is newer than depends file "/ci_container_base/ci/scratch/build-x86_64-pc-linux-gnu/src/test/fuzz/CMakeFiles/fuzz.dir/compiler_depend.internal".
[09:30:33.370] Dependencies file "src/test/fuzz/CMakeFiles/fuzz.dir/script_sigcache.cpp.o.d" is newer than depends file "/ci_container_base/ci/scratch/build-x86_64-pc-linux-gnu/src/test/fuzz/CMakeFiles/fuzz.dir/compiler_depend.internal".
[09:30:33.371] Dependencies file "src/test/fuzz/CMakeFiles/fuzz.dir/script_sign.cpp.o.d" is newer than depends file "/ci_container_base/ci/scratch/build-x86_64-pc-linux-gnu/src/test/fuzz/CMakeFiles/fuzz.dir/compiler_depend.internal".
[09:30:33.372] Dependencies file "src/test/fuzz/CMakeFiles/fuzz.dir/scriptnum_ops.cpp.o.d" is newer than depends file "/ci_container_base/ci/scratch/build-x86_64-pc-linux-gnu/src/test/fuzz/CMakeFiles/fuzz.dir/compiler_depend.internal".
[09:30:33.373] Dependencies file "src/test/fuzz/CMakeFiles/fuzz.dir/secp256k1_ec_seckey_import_export_der.cpp.o.d" is newer than depends file "/ci_container_base/ci/scratch/build-x86_64-pc-linux-gnu/src/test/fuzz/CMakeFiles/fuzz.dir/compiler_depend.internal".
[09:30:33.373] Dependencies file "src/test/fuzz/CMakeFiles/fuzz.dir/secp256k1_ecdsa_signature_parse_der_lax.cpp.o.d" is newer than depends file "/ci_container_base/ci/scratch/build-x86_64-pc-linux-gnu/src/test/fuzz/CMakeFiles/fuzz.dir/compiler_depend.internal".
[09:30:33.374] Dependencies file "src/test/fuzz/CMakeFiles/fuzz.dir/signature_checker.cpp.o.d" is newer than depends file "/ci_container_base/ci/scratch/build-x86_64-pc-linux-gnu/src/test/fuzz/CMakeFiles/fuzz.dir/compiler_depend.internal".
[09:30:33.375] Dependencies file "src/test/fuzz/CMakeFiles/fuzz.dir/signet.cpp.o.d" is newer than depends file "/ci_container_base/ci/scratch/build-x86_64-pc-linux-gnu/src/test/fuzz/CMakeFiles/fuzz.dir/compiler_depend.internal".
[09:30:33.376] Dependencies file "src/test/fuzz/CMakeFiles/fuzz.dir/socks5.cpp.o.d" is newer than depends file "/ci_container_base/ci/scratch/build-x86_64-pc-linux-gnu/src/test/fuzz/CMakeFiles/fuzz.dir/compiler_depend.internal".
[09:30:33.377] Dependencies file "src/test/fuzz/CMakeFiles/fuzz.dir/span.cpp.o.d" is newer than depends file "/ci_container_base/ci/scratch/build-x86_64-pc-linux-gnu/src/test/fuzz/CMakeFiles/fuzz.dir/compiler_depend.internal".
[09:30:33.378] Dependencies file "src/test/fuzz/CMakeFiles/fuzz.dir/string.cpp.o.d" is newer than depends file "/ci_container_base/ci/scratch/build-x86_64-pc-linux-gnu/src/test/fuzz/CMakeFiles/fuzz.dir/compiler_depend.internal".
[09:30:33.379] Dependencies file "src/test/fuzz/CMakeFiles/fuzz.dir/strprintf.cpp.o.d" is newer than depends file "/ci_container_base/ci/scratch/build-x86_64-pc-linux-gnu/src/test/fuzz/CMakeFiles/fuzz.dir/compiler_depend.internal".
[09:30:33.380] Dependencies file "src/test/fuzz/CMakeFiles/fuzz.dir/system.cpp.o.d" is newer than depends file "/ci_container_base/ci/scratch/build-x86_64-pc-linux-gnu/src/test/fuzz/CMakeFiles/fuzz.dir/compiler_depend.internal".
[09:30:33.381] Dependencies file "src/test/fuzz/CMakeFiles/fuzz.dir/timeoffsets.cpp.o.d" is newer than depends file "/ci_container_base/ci/scratch/build-x86_64-pc-linux-gnu/src/test/fuzz/CMakeFiles/fuzz.dir/compiler_depend.internal".
[09:30:33.381] Dependencies file "src/test/fuzz/CMakeFiles/fuzz.dir/torcontrol.cpp.o.d" is newer than depends file "/ci_container_base/ci/scratch/build-x86_64-pc-linux-gnu/src/test/fuzz/CMakeFiles/fuzz.dir/compiler_depend.internal".
[09:30:33.382] Dependencies file "src/test/fuzz/CMakeFiles/fuzz.dir/transaction.cpp.o.d" is newer than depends file "/ci_container_base/ci/scratch/build-x86_64-pc-linux-gnu/src/test/fuzz/CMakeFiles/fuzz.dir/compiler_depend.internal".
[09:30:33.385] Dependencies file "src/test/fuzz/CMakeFiles/fuzz.dir/tx_in.cpp.o.d" is newer than depends file "/ci_container_base/ci/scratch/build-x86_64-pc-linux-gnu/src/test/fuzz/CMakeFiles/fuzz.dir/compiler_depend.internal".
[09:30:33.385] Dependencies file "src/test/fuzz/CMakeFiles/fuzz.dir/tx_out.cpp.o.d" is newer than depends file "/ci_container_base/ci/scratch/build-x86_64-pc-linux-gnu/src/test/fuzz/CMakeFiles/fuzz.dir/compiler_depend.internal".
[09:30:33.386] Dependencies file "src/test/fuzz/CMakeFiles/fuzz.dir/tx_pool.cpp.o.d" is newer than depends file "/ci_container_base/ci/scratch/build-x86_64-pc-linux-gnu/src/test/fuzz/CMakeFiles/fuzz.dir/compiler_depend.internal".
[09:30:33.388] Dependencies file "src/test/fuzz/CMakeFiles/fuzz.dir/txdownloadman.cpp.o.d" is newer than depends file "/ci_container_base/ci/scratch/build-x86_64-pc-linux-gnu/src/test/fuzz/CMakeFiles/fuzz.dir/compiler_depend.internal".
[09:30:33.390] Dependencies file "src/test/fuzz/CMakeFiles/fuzz.dir/txgraph.cpp.o.d" is newer than depends file "/ci_container_base/ci/scratch/build-x86_64-pc-linux-gnu/src/test/fuzz/CMakeFiles/fuzz.dir/compiler_depend.internal".
[09:30:33.391] Dependencies file "src/test/fuzz/CMakeFiles/fuzz.dir/txorphan.cpp.o.d" is newer than depends file "/ci_container_base/ci/scratch/build-x86_64-pc-linux-gnu/src/test/fuzz/CMakeFiles/fuzz.dir/compiler_depend.internal".
[09:30:34.237] Consolidate compiler generated dependencies of target fuzz
[09:30:34.239] gmake[2]: Leaving directory '/ci_container_base/ci/scratch/build-x86_64-pc-linux-gnu'
[09:30:34.240] /usr/bin/gmake  -f src/test/fuzz/CMakeFiles/fuzz.dir/build.make src/test/fuzz/CMakeFiles/fuzz.dir/build
[09:30:34.339] gmake[2]: Entering directory '/ci_container_base/ci/scratch/build-x86_64-pc-linux-gnu'
[09:30:34.355] [ 86%] Building CXX object src/test/fuzz/CMakeFiles/fuzz.dir/miniscript.cpp.o
[09:30:34.357] cd /ci_container_base/ci/scratch/build-x86_64-pc-linux-gnu/src/test/fuzz && /usr/bin/ccache /usr/bin/clang++-20 -DBOOST_MULTI_INDEX_DISABLE_SERIALIZATION -DBOOST_NO_CXX98_FUNCTION_BASE -I/ci_container_base/ci/scratch/build-x86_64-pc-linux-gnu/src -I/ci_container_base/src -I/ci_container_base/src/univalue/include -I/ci_container_base/src/minisketch/include -I/ci_container_base/src/leveldb/include -I/ci_container_base/src/secp256k1/include -O0 -g0 -std=c++20 -fPIE -fdebug-prefix-map=/ci_container_base/src=. -fmacro-prefix-map=/ci_container_base/src=. -Wstack-protector -fstack-protector-all -fcf-protection=full -fstack-clash-protection -Werror -Wall -Wextra -Wgnu -Wformat -Wformat-security -Wvla -Wshadow-field -Wthread-safety -Wloop-analysis -Wredundant-decls -Wunused-member-function -Wdate-time -Wconditional-uninitialized -Woverloaded-virtual -Wsuggest-override -Wimplicit-fallthrough -Wunreachable-code -Wdocumentation -Wself-assign -Wundef -Wno-unused-parameter -MD -MT src/test/fuzz/CMakeFiles/fuzz.dir/miniscript.cpp.o -MF CMakeFiles/fuzz.dir/miniscript.cpp.o.d -o CMakeFiles/fuzz.dir/miniscript.cpp.o -c /ci_container_base/src/test/fuzz/miniscript.cpp  
[09:30:42.606] /ci_container_base/src/test/fuzz/miniscript.cpp:1040:42: error: no matching member function for call to 'ToString'
[09:30:42.606]  1040 |     std::optional<std::string> str{node->ToString(parser_ctx)};
[09:30:42.606]       |                                    ~~~~~~^~~~~~~~
[09:30:42.606] /ci_container_base/src/script/miniscript.h:830:17: note: candidate function template not viable: requires 2 arguments, but 1 was provided
[09:30:42.606]   830 |     std::string ToString(const CTx& ctx, bool& has_priv_key) const {
[09:30:42.606]       |                 ^        ~~~~~~~~~~~~~~~~~~~~~~~~~~~~~~~~~~
[09:30:42.606] /ci_container_base/src/test/fuzz/miniscript.cpp:1248:31: error: no matching member function for call to 'ToString'
[09:30:42.606]  1248 |     const auto str2 = parsed->ToString(parser_ctx);
[09:30:42.606]       |                       ~~~~~~~~^~~~~~~~
[09:30:42.606] /ci_container_base/src/script/miniscript.h:830:17: note: candidate function template not viable: requires 2 arguments, but 1 was provided
[09:30:42.606]   830 |     std::string ToString(const CTx& ctx, bool& has_priv_key) const {
[09:30:42.606]       |                 ^        ~~~~~~~~~~~~~~~~~~~~~~~~~~~~~~~~~~
[09:30:42.606] 2 errors generated.
[09:30:42.608] gmake[2]: *** [src/test/fuzz/CMakeFiles/fuzz.dir/build.make:860: src/test/fuzz/CMakeFiles/fuzz.dir/miniscript.cpp.o] Error 1
[09:30:42.608] gmake[2]: Leaving directory '/ci_container_base/ci/scratch/build-x86_64-pc-linux-gnu'
[09:30:42.609] gmake[1]: *** [CMakeFiles/Makefile2:1704: src/test/fuzz/CMakeFiles/fuzz.dir/all] Error 2
[09:30:42.609] gmake[1]: Leaving directory '/ci_container_base/ci/scratch/build-x86_64-pc-linux-gnu'
[09:30:42.610] gmake: *** [Makefile:146: all] Error 2
[09:30:42.613] 
[09:30:43.336] 
[09:30:43.336] Exit status: 2