Skip to content

[NOMERGE] ci: remove python from some jobs

Cirrus CI / macOS-cross, gui, no tests failed Jul 3, 2025 in 3m 20s

Task Summary

Instruction ci failed in 03:11

Details

✅ 00:04 clone
✅ 00:01 merge_base
❌ 03:11 ci

[07:46:45.499]         Linking CXX executable cmTC_15c8c
[07:46:45.499]         /usr/bin/cmake -E cmake_link_script CMakeFiles/cmTC_15c8c.dir/link.txt --verbose=1
[07:46:45.499]         /usr/bin/clang++ --target=x86_64-apple-darwin -isysroot/ci_container_base/depends/SDKs/Xcode-15.0-15A240d-extracted-SDK-with-libcxx-headers -nostdlibinc -iwithsysroot/usr/include/c++/v1 -iwithsysroot/usr/include -iframeworkwithsysroot/System/Library/Frameworks --target=x86_64-apple-darwin -pipe -std=c++20 -mmacos-version-min=13.0 -mlinker-version=711  -O2 -O2 -g -Wl,-search_paths_first -Wl,-headerpad_max_install_names -Wl,-platform_version,macos,13.0,14.0 -Wl,-no_adhoc_codesign -fuse-ld=lld  -Wl,--exclude-libs,ALL -Wl,-fatal_warnings CMakeFiles/cmTC_15c8c.dir/src.cxx.o -o cmTC_15c8c 
[07:46:45.499]         ld64.lld: error: unknown argument '--exclude-libs'
[07:46:45.499]         clang++: error: linker command failed with exit code 1 (use -v to see invocation)
[07:46:45.499]         gmake[1]: *** [CMakeFiles/cmTC_15c8c.dir/build.make:100: cmTC_15c8c] Error 1
[07:46:45.499]         gmake[1]: Leaving directory '/ci_container_base/ci/scratch/build-x86_64-apple-darwin/CMakeFiles/CMakeScratch/TryCompile-v3Ah6w'
[07:46:45.499]         gmake: *** [Makefile:127: cmTC_15c8c/fast] Error 2
[07:46:45.499]         
[07:46:45.499]       exitCode: 2
[07:46:45.499]   -
[07:46:45.499]     kind: "try_compile-v1"
[07:46:45.499]     backtrace:
[07:46:45.499]       - "/usr/share/cmake-3.28/Modules/Internal/CheckSourceCompiles.cmake:101 (try_compile)"
[07:46:45.499]       - "/usr/share/cmake-3.28/Modules/CheckCXXSourceCompiles.cmake:52 (cmake_check_source_compiles)"
[07:46:45.499]       - "cmake/module/TryAppendLinkerFlag.cmake:43 (check_cxx_source_compiles)"
[07:46:45.499]       - "CMakeLists.txt:567 (try_append_linker_flag)"
[07:46:45.499]     checks:
[07:46:45.499]       - "Performing Test LINKER_SUPPORTS__WL__NO_EXPORTED_SYMBOLS"
[07:46:45.499]     directories:
[07:46:45.499]       source: "/ci_container_base/ci/scratch/build-x86_64-apple-darwin/CMakeFiles/CMakeScratch/TryCompile-kMEwHn"
[07:46:45.499]       binary: "/ci_container_base/ci/scratch/build-x86_64-apple-darwin/CMakeFiles/CMakeScratch/TryCompile-kMEwHn"
[07:46:45.499]     cmakeVariables:
[07:46:45.499]       CMAKE_CXX_COMPILER_CLANG_SCAN_DEPS: "CMAKE_CXX_COMPILER_CLANG_SCAN_DEPS-NOTFOUND"
[07:46:45.499]       CMAKE_CXX_COMPILER_TARGET: "x86_64-apple-darwin"
[07:46:45.499]       CMAKE_CXX_COMPILE_OBJECT: "<CMAKE_CXX_COMPILER> <DEFINES> <INCLUDES> <FLAGS> -o <OBJECT> -c <SOURCE>  "
[07:46:45.499]       CMAKE_CXX_FLAGS: "-pipe -std=c++20 -mmacos-version-min=13.0 -mlinker-version=711"
[07:46:45.499]       CMAKE_CXX_FLAGS_RELWITHDEBINFO: "-O2 -O2 -g"
[07:46:45.499]       CMAKE_CXX_LINK_EXECUTABLE: "<CMAKE_CXX_COMPILER> <FLAGS> <CMAKE_CXX_LINK_FLAGS> <LINK_FLAGS> <OBJECTS> -o <TARGET> <LINK_LIBRARIES> "
[07:46:45.499]       CMAKE_CXX_LINK_NO_PIE_SUPPORTED: "1"
[07:46:45.499]       CMAKE_C_COMPILER_TARGET: "x86_64-apple-darwin"
[07:46:45.499]       CMAKE_EXE_LINKER_FLAGS: "-Wl,-platform_version,macos,13.0,14.0 -Wl,-no_adhoc_codesign -fuse-ld=lld"
[07:46:45.499]       CMAKE_MODULE_PATH: "/ci_container_base/cmake/module;/ci_container_base/depends/x86_64-apple-darwin/lib/cmake/Qt6;/ci_container_base/depends/x86_64-apple-darwin/lib/cmake/Qt6/3rdparty/extra-cmake-modules/find-modules;/ci_container_base/depends/x86_64-apple-darwin/lib/cmake/Qt6/3rdparty/kwin"
[07:46:45.499]       CMAKE_OBJCXX_COMPILER_TARGET: "x86_64-apple-darwin"
[07:46:45.499]       CMAKE_OSX_ARCHITECTURES: ""
[07:46:45.499]       CMAKE_OSX_SYSROOT: ""
[07:46:45.499]       CMAKE_POSITION_INDEPENDENT_CODE: "ON"
[07:46:45.499]       CMAKE_WARN_DEPRECATED: "TRUE"
[07:46:45.499]     buildResult:
[07:46:45.499]       variable: "LINKER_SUPPORTS__WL__NO_EXPORTED_SYMBOLS"
[07:46:45.499]       cached: true
[07:46:45.499]       stdout: |
[07:46:45.499]         Change Dir: '/ci_container_base/ci/scratch/build-x86_64-apple-darwin/CMakeFiles/CMakeScratch/TryCompile-kMEwHn'
[07:46:45.499]         
[07:46:45.499]         Run Build Command(s): /usr/bin/cmake -E env VERBOSE=1 /bin/gmake -f Makefile cmTC_32d45/fast
[07:46:45.499]         /bin/gmake  -f CMakeFiles/cmTC_32d45.dir/build.make CMakeFiles/cmTC_32d45.dir/build
[07:46:45.499]         gmake[1]: Entering directory '/ci_container_base/ci/scratch/build-x86_64-apple-darwin/CMakeFiles/CMakeScratch/TryCompile-kMEwHn'
[07:46:45.499]         Building CXX object CMakeFiles/cmTC_32d45.dir/src.cxx.o
[07:46:45.499]         /usr/bin/clang++ --target=x86_64-apple-darwin -isysroot/ci_container_base/depends/SDKs/Xcode-15.0-15A240d-extracted-SDK-with-libcxx-headers -nostdlibinc -iwithsysroot/usr/include/c++/v1 -iwithsysroot/usr/include -iframeworkwithsysroot/System/Library/Frameworks --target=x86_64-apple-darwin -DLINKER_SUPPORTS__WL__NO_EXPORTED_SYMBOLS  -pipe -std=c++20 -mmacos-version-min=13.0 -mlinker-version=711  -O2 -O2 -g -std=c++20 -fPIE -MD -MT CMakeFiles/cmTC_32d45.dir/src.cxx.o -MF CMakeFiles/cmTC_32d45.dir/src.cxx.o.d -o CMakeFiles/cmTC_32d45.dir/src.cxx.o -c /ci_container_base/ci/scratch/build-x86_64-apple-darwin/CMakeFiles/CMakeScratch/TryCompile-kMEwHn/src.cxx
[07:46:45.499]         Linking CXX executable cmTC_32d45
[07:46:45.499]         /usr/bin/cmake -E cmake_link_script CMakeFiles/cmTC_32d45.dir/link.txt --verbose=1
[07:46:45.499]         /usr/bin/clang++ --target=x86_64-apple-darwin -isysroot/ci_container_base/depends/SDKs/Xcode-15.0-15A240d-extracted-SDK-with-libcxx-headers -nostdlibinc -iwithsysroot/usr/include/c++/v1 -iwithsysroot/usr/include -iframeworkwithsysroot/System/Library/Frameworks --target=x86_64-apple-darwin -pipe -std=c++20 -mmacos-version-min=13.0 -mlinker-version=711  -O2 -O2 -g -Wl,-search_paths_first -Wl,-headerpad_max_install_names -Wl,-platform_version,macos,13.0,14.0 -Wl,-no_adhoc_codesign -fuse-ld=lld  -Wl,-no_exported_symbols -Wl,-fatal_warnings CMakeFiles/cmTC_32d45.dir/src.cxx.o -o cmTC_32d45 
[07:46:45.499]         gmake[1]: Leaving directory '/ci_container_base/ci/scratch/build-x86_64-apple-darwin/CMakeFiles/CMakeScratch/TryCompile-kMEwHn'
[07:46:45.499]         
[07:46:45.499]       exitCode: 0
[07:46:45.499] ...