Skip to content

Conversation

corngood
Copy link
Contributor

@corngood corngood commented Aug 13, 2025

Cc: @NixOS/dotnet

Things done

  • Built on platform:
    • x86_64-linux
    • aarch64-linux
    • x86_64-darwin
    • aarch64-darwin
  • Tested, as applicable:
  • Ran nixpkgs-review on this PR. See nixpkgs-review usage.
  • Tested basic functionality of all binary files, usually in ./result/bin/.
  • Nixpkgs Release Notes
    • Package update: when the change is major or breaking.
  • NixOS Release Notes
    • Module addition: when adding a new NixOS module.
    • Module update: when the change is significant.
  • Fits CONTRIBUTING.md, pkgs/README.md, maintainers/README.md and other READMEs.

Add a 👍 reaction to pull requests you find important.

@nixpkgs-ci nixpkgs-ci bot added 10.rebuild-linux: 11-100 This PR causes between 11 and 100 packages to rebuild on Linux. 10.rebuild-darwin: 11-100 This PR causes between 11 and 100 packages to rebuild on Darwin. 11.by: package-maintainer This PR was created by a maintainer of all the package it changes. 6.topic: dotnet Language: .NET labels Aug 13, 2025
@corngood corngood force-pushed the dotnet-update branch 2 times, most recently from 416d01f to 9273648 Compare August 13, 2025 13:07
@corngood
Copy link
Contributor Author

nixpkgs-review result

Generated using nixpkgs-review.

Command: nixpkgs-review pr 433244
Commit: 6676ebf40894009d495a96c41ca2ce0b6a94026f


x86_64-linux

✅ 13 packages built:
  • dotnet-aspnetcore_10 (dotnetCorePackages.aspnetcore_10_0, dotnetCorePackages.dotnet_10.aspnetcore)
  • dotnet-aspnetcore_10.man (dotnetCorePackages.aspnetcore_10_0.man, dotnetCorePackages.dotnet_10.aspnetcore.man)
  • dotnet-runtime_10 (dotnetCorePackages.dotnet_10.runtime, dotnetCorePackages.runtime_10_0)
  • dotnet-runtime_10.man (dotnetCorePackages.dotnet_10.runtime.man, dotnetCorePackages.runtime_10_0.man)
  • dotnet-sdk_10 (dotnetCorePackages.dotnet_10.sdk, dotnetCorePackages.sdk_10_0, dotnetCorePackages.sdk_10_0-source, dotnetCorePackages.sdk_10_0_1xx)
  • dotnet-sdk_10.man (dotnetCorePackages.dotnet_10.sdk.man, dotnetCorePackages.sdk_10_0-source.man, dotnetCorePackages.sdk_10_0.man, dotnetCorePackages.sdk_10_0_1xx.man)
  • dotnetCorePackages.aspnetcore_10_0-bin
  • dotnetCorePackages.dotnet_10.vmr
  • dotnetCorePackages.dotnet_10.vmr.debug
  • dotnetCorePackages.dotnet_10.vmr.man
  • dotnetCorePackages.generate-dotnet-sdk
  • dotnetCorePackages.runtime_10_0-bin
  • dotnetCorePackages.sdk_10_0-bin (dotnetCorePackages.sdk_10_0_1xx-bin)

@corngood
Copy link
Contributor Author

nixpkgs-review result

Generated using nixpkgs-review.

Command: nixpkgs-review pr 433244
Commit: 954b774bb5eba412f1e930f9501721b866fab58b


x86_64-linux

❌ 1 package failed to build:
  • roslyn-ls
✅ 13 packages built:
  • dotnet-aspnetcore_10 (dotnetCorePackages.aspnetcore_10_0, dotnetCorePackages.dotnet_10.aspnetcore)
  • dotnet-aspnetcore_10.man (dotnetCorePackages.aspnetcore_10_0.man, dotnetCorePackages.dotnet_10.aspnetcore.man)
  • dotnet-runtime_10 (dotnetCorePackages.dotnet_10.runtime, dotnetCorePackages.runtime_10_0)
  • dotnet-runtime_10.man (dotnetCorePackages.dotnet_10.runtime.man, dotnetCorePackages.runtime_10_0.man)
  • dotnet-sdk_10 (dotnetCorePackages.dotnet_10.sdk, dotnetCorePackages.sdk_10_0, dotnetCorePackages.sdk_10_0-source, dotnetCorePackages.sdk_10_0_1xx)
  • dotnet-sdk_10.man (dotnetCorePackages.dotnet_10.sdk.man, dotnetCorePackages.sdk_10_0-source.man, dotnetCorePackages.sdk_10_0.man, dotnetCorePackages.sdk_10_0_1xx.man)
  • dotnetCorePackages.aspnetcore_10_0-bin
  • dotnetCorePackages.dotnet_10.vmr
  • dotnetCorePackages.dotnet_10.vmr.debug
  • dotnetCorePackages.dotnet_10.vmr.man
  • dotnetCorePackages.generate-dotnet-sdk
  • dotnetCorePackages.runtime_10_0-bin
  • dotnetCorePackages.sdk_10_0-bin (dotnetCorePackages.sdk_10_0_1xx-bin)

Error logs: `x86_64-linux`
roslyn-ls
  Restored /build/source/src/LanguageServer/ExternalAccess/Copilot/Microsoft.CodeAnalysis.LanguageServer.ExternalAccess.Copilot.csproj (in 376 ms).
  Restored /build/source/src/Features/ExternalAccess/AspNetCore/Microsoft.CodeAnalysis.ExternalAccess.AspNetCore.csproj (in 354 ms).
  Failed to restore /build/source/src/Workspaces/MSBuild/BuildHost/Microsoft.CodeAnalysis.Workspaces.MSBuild.BuildHost.csproj (in 367 ms).
  Failed to restore /build/source/src/Tools/Source/CompilerGeneratorTools/Source/CSharpSyntaxGenerator/CSharpSyntaxGenerator.csproj (in 354 ms).
  Failed to restore /build/source/src/Compilers/Core/Portable/Microsoft.CodeAnalysis.csproj (in 382 ms).
  Failed to restore /build/source/src/Tools/ExternalAccess/RazorCompiler/Microsoft.CodeAnalysis.ExternalAccess.RazorCompiler.csproj (in 384 ms).
  Failed to restore /build/source/src/Scripting/Core/Microsoft.CodeAnalysis.Scripting.csproj (in 386 ms).
  Failed to restore /build/source/src/Workspaces/Core/Portable/Microsoft.CodeAnalysis.Workspaces.csproj (in 397 ms).
  Failed to restore /build/source/src/Compilers/CSharp/Portable/Microsoft.CodeAnalysis.CSharp.csproj (in 383 ms).
  Failed to restore /build/source/src/Workspaces/MSBuild/Core/Microsoft.CodeAnalysis.Workspaces.MSBuild.csproj (in 408 ms).
  Failed to restore /build/source/src/Features/Core/Portable/Microsoft.CodeAnalysis.Features.csproj (in 400 ms).
  Failed to restore /build/source/src/Workspaces/CSharp/Portable/Microsoft.CodeAnalysis.CSharp.Workspaces.csproj (in 392 ms).
  Failed to restore /build/source/src/Features/ExternalAccess/Copilot/Microsoft.CodeAnalysis.ExternalAccess.Copilot.csproj (in 380 ms).
  Failed to restore /build/source/src/LanguageServer/Protocol/Microsoft.CodeAnalysis.LanguageServer.Protocol.csproj (in 408 ms).
  Failed to restore /build/source/src/Workspaces/Remote/Core/Microsoft.CodeAnalysis.Remote.Workspaces.csproj (in 417 ms).
  Failed to restore /build/source/src/LanguageServer/ExternalAccess/CompilerDeveloperSDK/Microsoft.CodeAnalysis.ExternalAccess.CompilerDeveloperSDK.csproj (in 354 ms).
  Failed to restore /build/source/src/Features/CSharp/Portable/Microsoft.CodeAnalysis.CSharp.Features.csproj (in 400 ms).
  Failed to restore /build/source/src/LanguageServer/ExternalAccess/VisualDiagnostics/Microsoft.CodeAnalysis.ExternalAccess.VisualDiagnostics.csproj (in 376 ms).
  Failed to restore /build/source/src/LanguageServer/Microsoft.CodeAnalysis.LanguageServer/Microsoft.CodeAnalysis.LanguageServer.csproj (in 408 ms).
  Failed to restore /build/source/src/Tools/ExternalAccess/Razor/Features/Microsoft.CodeAnalysis.ExternalAccess.Razor.Features.csproj (in 431 ms).

@corngood
Copy link
Contributor Author

nixpkgs-review result

Generated using nixpkgs-review.

Command: nixpkgs-review pr 433244
Commit: 954b774bb5eba412f1e930f9501721b866fab58b


aarch64-darwin

❌ 1 package failed to build:
  • roslyn-ls
✅ 12 packages built:
  • dotnet-aspnetcore_10 (dotnetCorePackages.aspnetcore_10_0, dotnetCorePackages.dotnet_10.aspnetcore)
  • dotnet-aspnetcore_10.man (dotnetCorePackages.aspnetcore_10_0.man, dotnetCorePackages.dotnet_10.aspnetcore.man)
  • dotnet-runtime_10 (dotnetCorePackages.dotnet_10.runtime, dotnetCorePackages.runtime_10_0)
  • dotnet-runtime_10.man (dotnetCorePackages.dotnet_10.runtime.man, dotnetCorePackages.runtime_10_0.man)
  • dotnet-sdk_10 (dotnetCorePackages.dotnet_10.sdk, dotnetCorePackages.sdk_10_0, dotnetCorePackages.sdk_10_0-source, dotnetCorePackages.sdk_10_0_1xx)
  • dotnet-sdk_10.man (dotnetCorePackages.dotnet_10.sdk.man, dotnetCorePackages.sdk_10_0-source.man, dotnetCorePackages.sdk_10_0.man, dotnetCorePackages.sdk_10_0_1xx.man)
  • dotnetCorePackages.aspnetcore_10_0-bin
  • dotnetCorePackages.dotnet_10.vmr
  • dotnetCorePackages.dotnet_10.vmr.man
  • dotnetCorePackages.generate-dotnet-sdk
  • dotnetCorePackages.runtime_10_0-bin
  • dotnetCorePackages.sdk_10_0-bin (dotnetCorePackages.sdk_10_0_1xx-bin)

Error logs: `aarch64-darwin`
roslyn-ls
/private/tmp/nix-build-roslyn-ls-5.0.0-2.25371.17.drv-0/source/src/Workspaces/MSBuild/BuildHost/Microsoft.CodeAnalysis.Workspaces.MSBuild.BuildHost.csproj : error NU1102: Unable to find package Microsoft.NETCore.App.Ref with version (= 8.0.18) [/private/tmp/nix-build-roslyn-ls-5.0.0-2.25371.17.drv-0/source/src/LanguageServer/Microsoft.CodeAnalysis.LanguageServer/Microsoft.CodeAnalysis.LanguageServer.csproj]
/private/tmp/nix-build-roslyn-ls-5.0.0-2.25371.17.drv-0/source/src/Workspaces/MSBuild/BuildHost/Microsoft.CodeAnalysis.Workspaces.MSBuild.BuildHost.csproj : error NU1102:   - Found 4 version(s) in _nix [ Nearest version: 8.0.19 ] [/private/tmp/nix-build-roslyn-ls-5.0.0-2.25371.17.drv-0/source/src/LanguageServer/Microsoft.CodeAnalysis.LanguageServer/Microsoft.CodeAnalysis.LanguageServer.csproj]
/private/tmp/nix-build-roslyn-ls-5.0.0-2.25371.17.drv-0/source/src/Workspaces/MSBuild/BuildHost/Microsoft.CodeAnalysis.Workspaces.MSBuild.BuildHost.csproj : error NU1102:   - Found 0 version(s) in /nix/store/csnj88f0f00cxc45qc6yqnhx0gd0018b-dotnet-sdk-10.0.100-preview.7.25380.108/share/dotnet/library-packs [/private/tmp/nix-build-roslyn-ls-5.0.0-2.25371.17.drv-0/source/src/LanguageServer/Microsoft.CodeAnalysis.LanguageServer/Microsoft.CodeAnalysis.LanguageServer.csproj]
/private/tmp/nix-build-roslyn-ls-5.0.0-2.25371.17.drv-0/source/src/Workspaces/MSBuild/BuildHost/Microsoft.CodeAnalysis.Workspaces.MSBuild.BuildHost.csproj : error NU1102: Unable to find package Microsoft.NETCore.App.Runtime.osx-arm64 with version (= 8.0.18) [/private/tmp/nix-build-roslyn-ls-5.0.0-2.25371.17.drv-0/source/src/LanguageServer/Microsoft.CodeAnalysis.LanguageServer/Microsoft.CodeAnalysis.LanguageServer.csproj]
/private/tmp/nix-build-roslyn-ls-5.0.0-2.25371.17.drv-0/source/src/Workspaces/MSBuild/BuildHost/Microsoft.CodeAnalysis.Workspaces.MSBuild.BuildHost.csproj : error NU1102:   - Found 4 version(s) in _nix [ Nearest version: 8.0.19 ] [/private/tmp/nix-build-roslyn-ls-5.0.0-2.25371.17.drv-0/source/src/LanguageServer/Microsoft.CodeAnalysis.LanguageServer/Microsoft.CodeAnalysis.LanguageServer.csproj]
/private/tmp/nix-build-roslyn-ls-5.0.0-2.25371.17.drv-0/source/src/Workspaces/MSBuild/BuildHost/Microsoft.CodeAnalysis.Workspaces.MSBuild.BuildHost.csproj : error NU1102:   - Found 0 version(s) in /nix/store/csnj88f0f00cxc45qc6yqnhx0gd0018b-dotnet-sdk-10.0.100-preview.7.25380.108/share/dotnet/library-packs [/private/tmp/nix-build-roslyn-ls-5.0.0-2.25371.17.drv-0/source/src/LanguageServer/Microsoft.CodeAnalysis.LanguageServer/Microsoft.CodeAnalysis.LanguageServer.csproj]
/private/tmp/nix-build-roslyn-ls-5.0.0-2.25371.17.drv-0/source/src/Workspaces/MSBuild/BuildHost/Microsoft.CodeAnalysis.Workspaces.MSBuild.BuildHost.csproj : error NU1102: Unable to find package Microsoft.AspNetCore.App.Ref with version (= 8.0.18) [/private/tmp/nix-build-roslyn-ls-5.0.0-2.25371.17.drv-0/source/src/LanguageServer/Microsoft.CodeAnalysis.LanguageServer/Microsoft.CodeAnalysis.LanguageServer.csproj]
/private/tmp/nix-build-roslyn-ls-5.0.0-2.25371.17.drv-0/source/src/Workspaces/MSBuild/BuildHost/Microsoft.CodeAnalysis.Workspaces.MSBuild.BuildHost.csproj : error NU1102:   - Found 4 version(s) in _nix [ Nearest version: 8.0.19 ] [/private/tmp/nix-build-roslyn-ls-5.0.0-2.25371.17.drv-0/source/src/LanguageServer/Microsoft.CodeAnalysis.LanguageServer/Microsoft.CodeAnalysis.LanguageServer.csproj]
/private/tmp/nix-build-roslyn-ls-5.0.0-2.25371.17.drv-0/source/src/Workspaces/MSBuild/BuildHost/Microsoft.CodeAnalysis.Workspaces.MSBuild.BuildHost.csproj : error NU1102:   - Found 0 version(s) in /nix/store/csnj88f0f00cxc45qc6yqnhx0gd0018b-dotnet-sdk-10.0.100-preview.7.25380.108/share/dotnet/library-packs [/private/tmp/nix-build-roslyn-ls-5.0.0-2.25371.17.drv-0/source/src/LanguageServer/Microsoft.CodeAnalysis.LanguageServer/Microsoft.CodeAnalysis.LanguageServer.csproj]
/private/tmp/nix-build-roslyn-ls-5.0.0-2.25371.17.drv-0/source/src/Workspaces/MSBuild/BuildHost/Microsoft.CodeAnalysis.Workspaces.MSBuild.BuildHost.csproj : error NU1102: Unable to find package Microsoft.AspNetCore.App.Runtime.osx-arm64 with version (= 8.0.18) [/private/tmp/nix-build-roslyn-ls-5.0.0-2.25371.17.drv-0/source/src/LanguageServer/Microsoft.CodeAnalysis.LanguageServer/Microsoft.CodeAnalysis.LanguageServer.csproj]
/private/tmp/nix-build-roslyn-ls-5.0.0-2.25371.17.drv-0/source/src/Workspaces/MSBuild/BuildHost/Microsoft.CodeAnalysis.Workspaces.MSBuild.BuildHost.csproj : error NU1102:   - Found 4 version(s) in _nix [ Nearest version: 8.0.19 ] [/private/tmp/nix-build-roslyn-ls-5.0.0-2.25371.17.drv-0/source/src/LanguageServer/Microsoft.CodeAnalysis.LanguageServer/Microsoft.CodeAnalysis.LanguageServer.csproj]
/private/tmp/nix-build-roslyn-ls-5.0.0-2.25371.17.drv-0/source/src/Workspaces/MSBuild/BuildHost/Microsoft.CodeAnalysis.Workspaces.MSBuild.BuildHost.csproj : error NU1102:   - Found 0 version(s) in /nix/store/csnj88f0f00cxc45qc6yqnhx0gd0018b-dotnet-sdk-10.0.100-preview.7.25380.108/share/dotnet/library-packs [/private/tmp/nix-build-roslyn-ls-5.0.0-2.25371.17.drv-0/source/src/LanguageServer/Microsoft.CodeAnalysis.LanguageServer/Microsoft.CodeAnalysis.LanguageServer.csproj]
/private/tmp/nix-build-roslyn-ls-5.0.0-2.25371.17.drv-0/source/src/Workspaces/MSBuild/BuildHost/Microsoft.CodeAnalysis.Workspaces.MSBuild.BuildHost.csproj : error NU1102: Unable to find package Microsoft.NETCore.App.Host.osx-arm64 with version (= 8.0.18) [/private/tmp/nix-build-roslyn-ls-5.0.0-2.25371.17.drv-0/source/src/LanguageServer/Microsoft.CodeAnalysis.LanguageServer/Microsoft.CodeAnalysis.LanguageServer.csproj]
/private/tmp/nix-build-roslyn-ls-5.0.0-2.25371.17.drv-0/source/src/Workspaces/MSBuild/BuildHost/Microsoft.CodeAnalysis.Workspaces.MSBuild.BuildHost.csproj : error NU1102:   - Found 4 version(s) in _nix [ Nearest version: 8.0.19 ] [/private/tmp/nix-build-roslyn-ls-5.0.0-2.25371.17.drv-0/source/src/LanguageServer/Microsoft.CodeAnalysis.LanguageServer/Microsoft.CodeAnalysis.LanguageServer.csproj]
/private/tmp/nix-build-roslyn-ls-5.0.0-2.25371.17.drv-0/source/src/Workspaces/MSBuild/BuildHost/Microsoft.CodeAnalysis.Workspaces.MSBuild.BuildHost.csproj : error NU1102:   - Found 0 version(s) in /nix/store/csnj88f0f00cxc45qc6yqnhx0gd0018b-dotnet-sdk-10.0.100-preview.7.25380.108/share/dotnet/library-packs [/private/tmp/nix-build-roslyn-ls-5.0.0-2.25371.17.drv-0/source/src/LanguageServer/Microsoft.CodeAnalysis.LanguageServer/Microsoft.CodeAnalysis.LanguageServer.csproj]
  Failed to restore /private/tmp/nix-build-roslyn-ls-5.0.0-2.25371.17.drv-0/source/src/LanguageServer/Protocol/Microsoft.CodeAnalysis.LanguageServer.Protocol.csproj (in 75 ms).
  Failed to restore /private/tmp/nix-build-roslyn-ls-5.0.0-2.25371.17.drv-0/source/src/Workspaces/MSBuild/BuildHost/Microsoft.CodeAnalysis.Workspaces.MSBuild.BuildHost.csproj (in 62 ms).
  Failed to restore /private/tmp/nix-build-roslyn-ls-5.0.0-2.25371.17.drv-0/source/src/Workspaces/Remote/Core/Microsoft.CodeAnalysis.Remote.Workspaces.csproj (in 104 ms).
  Failed to restore /private/tmp/nix-build-roslyn-ls-5.0.0-2.25371.17.drv-0/source/src/Features/ExternalAccess/Copilot/Microsoft.CodeAnalysis.ExternalAccess.Copilot.csproj (in 145 ms).
  Failed to restore /private/tmp/nix-build-roslyn-ls-5.0.0-2.25371.17.drv-0/source/src/Workspaces/MSBuild/Core/Microsoft.CodeAnalysis.Workspaces.MSBuild.csproj (in 110 ms).

@GGG-KILLER
Copy link
Contributor

nixpkgs-review result

Generated using nixpkgs-review-gha

Command: nixpkgs-review pr 433244
Commit: 954b774bb5eba412f1e930f9501721b866fab58b (subsequent changes)
Merge: d845ee06d49e94389b321c2b10c13ae643c02118

Logs: https://github.com/GGG-KILLER/nixpkgs-review-gha/actions/runs/17073323168


x86_64-linux

❌ 1 package failed to build:
  • roslyn-ls
✅ 13 packages built:
  • dotnet-aspnetcore_10 (dotnetCorePackages.aspnetcore_10_0, dotnetCorePackages.dotnet_10.aspnetcore)
  • dotnet-aspnetcore_10.man (dotnetCorePackages.aspnetcore_10_0.man, dotnetCorePackages.dotnet_10.aspnetcore.man)
  • dotnet-runtime_10 (dotnetCorePackages.dotnet_10.runtime, dotnetCorePackages.runtime_10_0)
  • dotnet-runtime_10.man (dotnetCorePackages.dotnet_10.runtime.man, dotnetCorePackages.runtime_10_0.man)
  • dotnet-sdk_10 (dotnetCorePackages.dotnet_10.sdk, dotnetCorePackages.sdk_10_0, dotnetCorePackages.sdk_10_0-source, dotnetCorePackages.sdk_10_0_1xx)
  • dotnet-sdk_10.man (dotnetCorePackages.dotnet_10.sdk.man, dotnetCorePackages.sdk_10_0-source.man, dotnetCorePackages.sdk_10_0.man, dotnetCorePackages.sdk_10_0_1xx.man)
  • dotnetCorePackages.aspnetcore_10_0-bin
  • dotnetCorePackages.dotnet_10.vmr
  • dotnetCorePackages.dotnet_10.vmr.debug
  • dotnetCorePackages.dotnet_10.vmr.man
  • dotnetCorePackages.generate-dotnet-sdk
  • dotnetCorePackages.runtime_10_0-bin
  • dotnetCorePackages.sdk_10_0-bin (dotnetCorePackages.sdk_10_0_1xx-bin)

Error logs: `x86_64-linux`
roslyn-ls
/build/source/src/Scripting/Core/Microsoft.CodeAnalysis.Scripting.csproj : error NU1102:   - Found 0 version(s) in /nix/store/c0mk0w4z17mr1sxq8n89i1nvjk8aq102-dotnet-sdk-10.0.100-preview.7.25380.108/share/dotnet/library-packs [/build/source/src/LanguageServer/Microsoft.CodeAnalysis.LanguageServer/Microsoft.CodeAnalysis.LanguageServer.csproj]
  Failed to restore /build/source/src/Tools/ExternalAccess/RazorCompiler/Microsoft.CodeAnalysis.ExternalAccess.RazorCompiler.csproj (in 124 ms).
/build/source/src/LanguageServer/Protocol/Microsoft.CodeAnalysis.LanguageServer.Protocol.csproj : error NU1102: Unable to find package Microsoft.NETCore.App.Ref with version (= 8.0.18) [/build/source/src/LanguageServer/Microsoft.CodeAnalysis.LanguageServer/Microsoft.CodeAnalysis.LanguageServer.csproj]
/build/source/src/LanguageServer/Protocol/Microsoft.CodeAnalysis.LanguageServer.Protocol.csproj : error NU1102:   - Found 4 version(s) in _nix [ Nearest version: 8.0.19 ] [/build/source/src/LanguageServer/Microsoft.CodeAnalysis.LanguageServer/Microsoft.CodeAnalysis.LanguageServer.csproj]
/build/source/src/LanguageServer/Protocol/Microsoft.CodeAnalysis.LanguageServer.Protocol.csproj : error NU1102:   - Found 0 version(s) in /nix/store/c0mk0w4z17mr1sxq8n89i1nvjk8aq102-dotnet-sdk-10.0.100-preview.7.25380.108/share/dotnet/library-packs [/build/source/src/LanguageServer/Microsoft.CodeAnalysis.LanguageServer/Microsoft.CodeAnalysis.LanguageServer.csproj]
/build/source/src/LanguageServer/Protocol/Microsoft.CodeAnalysis.LanguageServer.Protocol.csproj : error NU1102: Unable to find package Microsoft.NETCore.App.Runtime.linux-x64 with version (= 8.0.18) [/build/source/src/LanguageServer/Microsoft.CodeAnalysis.LanguageServer/Microsoft.CodeAnalysis.LanguageServer.csproj]
/build/source/src/LanguageServer/Protocol/Microsoft.CodeAnalysis.LanguageServer.Protocol.csproj : error NU1102:   - Found 4 version(s) in _nix [ Nearest version: 8.0.19 ] [/build/source/src/LanguageServer/Microsoft.CodeAnalysis.LanguageServer/Microsoft.CodeAnalysis.LanguageServer.csproj]
/build/source/src/LanguageServer/Protocol/Microsoft.CodeAnalysis.LanguageServer.Protocol.csproj : error NU1102:   - Found 0 version(s) in /nix/store/c0mk0w4z17mr1sxq8n89i1nvjk8aq102-dotnet-sdk-10.0.100-preview.7.25380.108/share/dotnet/library-packs [/build/source/src/LanguageServer/Microsoft.CodeAnalysis.LanguageServer/Microsoft.CodeAnalysis.LanguageServer.csproj]
/build/source/src/LanguageServer/Protocol/Microsoft.CodeAnalysis.LanguageServer.Protocol.csproj : error NU1102: Unable to find package Microsoft.AspNetCore.App.Ref with version (= 8.0.18) [/build/source/src/LanguageServer/Microsoft.CodeAnalysis.LanguageServer/Microsoft.CodeAnalysis.LanguageServer.csproj]
/build/source/src/LanguageServer/Protocol/Microsoft.CodeAnalysis.LanguageServer.Protocol.csproj : error NU1102:   - Found 4 version(s) in _nix [ Nearest version: 8.0.19 ] [/build/source/src/LanguageServer/Microsoft.CodeAnalysis.LanguageServer/Microsoft.CodeAnalysis.LanguageServer.csproj]
/build/source/src/LanguageServer/Protocol/Microsoft.CodeAnalysis.LanguageServer.Protocol.csproj : error NU1102:   - Found 0 version(s) in /nix/store/c0mk0w4z17mr1sxq8n89i1nvjk8aq102-dotnet-sdk-10.0.100-preview.7.25380.108/share/dotnet/library-packs [/build/source/src/LanguageServer/Microsoft.CodeAnalysis.LanguageServer/Microsoft.CodeAnalysis.LanguageServer.csproj]
/build/source/src/LanguageServer/Protocol/Microsoft.CodeAnalysis.LanguageServer.Protocol.csproj : error NU1102: Unable to find package Microsoft.AspNetCore.App.Runtime.linux-x64 with version (= 8.0.18) [/build/source/src/LanguageServer/Microsoft.CodeAnalysis.LanguageServer/Microsoft.CodeAnalysis.LanguageServer.csproj]
/build/source/src/LanguageServer/Protocol/Microsoft.CodeAnalysis.LanguageServer.Protocol.csproj : error NU1102:   - Found 4 version(s) in _nix [ Nearest version: 8.0.19 ] [/build/source/src/LanguageServer/Microsoft.CodeAnalysis.LanguageServer/Microsoft.CodeAnalysis.LanguageServer.csproj]
/build/source/src/LanguageServer/Protocol/Microsoft.CodeAnalysis.LanguageServer.Protocol.csproj : error NU1102:   - Found 0 version(s) in /nix/store/c0mk0w4z17mr1sxq8n89i1nvjk8aq102-dotnet-sdk-10.0.100-preview.7.25380.108/share/dotnet/library-packs [/build/source/src/LanguageServer/Microsoft.CodeAnalysis.LanguageServer/Microsoft.CodeAnalysis.LanguageServer.csproj]
/build/source/src/LanguageServer/Protocol/Microsoft.CodeAnalysis.LanguageServer.Protocol.csproj : error NU1102: Unable to find package Microsoft.NETCore.App.Host.linux-x64 with version (= 8.0.18) [/build/source/src/LanguageServer/Microsoft.CodeAnalysis.LanguageServer/Microsoft.CodeAnalysis.LanguageServer.csproj]
/build/source/src/LanguageServer/Protocol/Microsoft.CodeAnalysis.LanguageServer.Protocol.csproj : error NU1102:   - Found 4 version(s) in _nix [ Nearest version: 8.0.19 ] [/build/source/src/LanguageServer/Microsoft.CodeAnalysis.LanguageServer/Microsoft.CodeAnalysis.LanguageServer.csproj]
/build/source/src/LanguageServer/Protocol/Microsoft.CodeAnalysis.LanguageServer.Protocol.csproj : error NU1102:   - Found 0 version(s) in /nix/store/c0mk0w4z17mr1sxq8n89i1nvjk8aq102-dotnet-sdk-10.0.100-preview.7.25380.108/share/dotnet/library-packs [/build/source/src/LanguageServer/Microsoft.CodeAnalysis.LanguageServer/Microsoft.CodeAnalysis.LanguageServer.csproj]
  Failed to restore /build/source/src/Scripting/Core/Microsoft.CodeAnalysis.Scripting.csproj (in 57 ms).
  Failed to restore /build/source/src/LanguageServer/Protocol/Microsoft.CodeAnalysis.LanguageServer.Protocol.csproj (in 94 ms).
  Failed to restore /build/source/src/Tools/ExternalAccess/Razor/Features/Microsoft.CodeAnalysis.ExternalAccess.Razor.Features.csproj (in 223 ms).

aarch64-linux

❌ 1 package failed to build:
  • roslyn-ls
✅ 13 packages built:
  • dotnet-aspnetcore_10 (dotnetCorePackages.aspnetcore_10_0, dotnetCorePackages.dotnet_10.aspnetcore)
  • dotnet-aspnetcore_10.man (dotnetCorePackages.aspnetcore_10_0.man, dotnetCorePackages.dotnet_10.aspnetcore.man)
  • dotnet-runtime_10 (dotnetCorePackages.dotnet_10.runtime, dotnetCorePackages.runtime_10_0)
  • dotnet-runtime_10.man (dotnetCorePackages.dotnet_10.runtime.man, dotnetCorePackages.runtime_10_0.man)
  • dotnet-sdk_10 (dotnetCorePackages.dotnet_10.sdk, dotnetCorePackages.sdk_10_0, dotnetCorePackages.sdk_10_0-source, dotnetCorePackages.sdk_10_0_1xx)
  • dotnet-sdk_10.man (dotnetCorePackages.dotnet_10.sdk.man, dotnetCorePackages.sdk_10_0-source.man, dotnetCorePackages.sdk_10_0.man, dotnetCorePackages.sdk_10_0_1xx.man)
  • dotnetCorePackages.aspnetcore_10_0-bin
  • dotnetCorePackages.dotnet_10.vmr
  • dotnetCorePackages.dotnet_10.vmr.debug
  • dotnetCorePackages.dotnet_10.vmr.man
  • dotnetCorePackages.generate-dotnet-sdk
  • dotnetCorePackages.runtime_10_0-bin
  • dotnetCorePackages.sdk_10_0-bin (dotnetCorePackages.sdk_10_0_1xx-bin)

Error logs: `aarch64-linux`
roslyn-ls
/build/source/src/Compilers/CSharp/Portable/Microsoft.CodeAnalysis.CSharp.csproj : error NU1102:   - Found 0 version(s) in /nix/store/2r7i28ndk02rpmvfkv2pzpj0n6zk78b3-dotnet-sdk-10.0.100-preview.7.25380.108/share/dotnet/library-packs [/build/source/src/LanguageServer/Microsoft.CodeAnalysis.LanguageServer/Microsoft.CodeAnalysis.LanguageServer.csproj]
/build/source/src/Compilers/CSharp/Portable/Microsoft.CodeAnalysis.CSharp.csproj : error NU1102: Unable to find package Microsoft.NETCore.App.Ref with version (= 8.0.18) [/build/source/src/LanguageServer/Microsoft.CodeAnalysis.LanguageServer/Microsoft.CodeAnalysis.LanguageServer.csproj]
/build/source/src/Compilers/CSharp/Portable/Microsoft.CodeAnalysis.CSharp.csproj : error NU1102:   - Found 4 version(s) in _nix [ Nearest version: 8.0.19 ] [/build/source/src/LanguageServer/Microsoft.CodeAnalysis.LanguageServer/Microsoft.CodeAnalysis.LanguageServer.csproj]
/build/source/src/Compilers/CSharp/Portable/Microsoft.CodeAnalysis.CSharp.csproj : error NU1102:   - Found 0 version(s) in /nix/store/2r7i28ndk02rpmvfkv2pzpj0n6zk78b3-dotnet-sdk-10.0.100-preview.7.25380.108/share/dotnet/library-packs [/build/source/src/LanguageServer/Microsoft.CodeAnalysis.LanguageServer/Microsoft.CodeAnalysis.LanguageServer.csproj]
/build/source/src/Compilers/CSharp/Portable/Microsoft.CodeAnalysis.CSharp.csproj : error NU1102: Unable to find package Microsoft.NETCore.App.Runtime.linux-arm64 with version (= 8.0.18) [/build/source/src/LanguageServer/Microsoft.CodeAnalysis.LanguageServer/Microsoft.CodeAnalysis.LanguageServer.csproj]
/build/source/src/Compilers/CSharp/Portable/Microsoft.CodeAnalysis.CSharp.csproj : error NU1102:   - Found 4 version(s) in _nix [ Nearest version: 8.0.19 ] [/build/source/src/LanguageServer/Microsoft.CodeAnalysis.LanguageServer/Microsoft.CodeAnalysis.LanguageServer.csproj]
/build/source/src/Compilers/CSharp/Portable/Microsoft.CodeAnalysis.CSharp.csproj : error NU1102:   - Found 0 version(s) in /nix/store/2r7i28ndk02rpmvfkv2pzpj0n6zk78b3-dotnet-sdk-10.0.100-preview.7.25380.108/share/dotnet/library-packs [/build/source/src/LanguageServer/Microsoft.CodeAnalysis.LanguageServer/Microsoft.CodeAnalysis.LanguageServer.csproj]
/build/source/src/Compilers/CSharp/Portable/Microsoft.CodeAnalysis.CSharp.csproj : error NU1102: Unable to find package Microsoft.AspNetCore.App.Ref with version (= 8.0.18) [/build/source/src/LanguageServer/Microsoft.CodeAnalysis.LanguageServer/Microsoft.CodeAnalysis.LanguageServer.csproj]
/build/source/src/Compilers/CSharp/Portable/Microsoft.CodeAnalysis.CSharp.csproj : error NU1102:   - Found 4 version(s) in _nix [ Nearest version: 8.0.19 ] [/build/source/src/LanguageServer/Microsoft.CodeAnalysis.LanguageServer/Microsoft.CodeAnalysis.LanguageServer.csproj]
/build/source/src/Compilers/CSharp/Portable/Microsoft.CodeAnalysis.CSharp.csproj : error NU1102:   - Found 0 version(s) in /nix/store/2r7i28ndk02rpmvfkv2pzpj0n6zk78b3-dotnet-sdk-10.0.100-preview.7.25380.108/share/dotnet/library-packs [/build/source/src/LanguageServer/Microsoft.CodeAnalysis.LanguageServer/Microsoft.CodeAnalysis.LanguageServer.csproj]
/build/source/src/Compilers/CSharp/Portable/Microsoft.CodeAnalysis.CSharp.csproj : error NU1102: Unable to find package Microsoft.AspNetCore.App.Runtime.linux-arm64 with version (= 8.0.18) [/build/source/src/LanguageServer/Microsoft.CodeAnalysis.LanguageServer/Microsoft.CodeAnalysis.LanguageServer.csproj]
/build/source/src/Compilers/CSharp/Portable/Microsoft.CodeAnalysis.CSharp.csproj : error NU1102:   - Found 4 version(s) in _nix [ Nearest version: 8.0.19 ] [/build/source/src/LanguageServer/Microsoft.CodeAnalysis.LanguageServer/Microsoft.CodeAnalysis.LanguageServer.csproj]
/build/source/src/Compilers/CSharp/Portable/Microsoft.CodeAnalysis.CSharp.csproj : error NU1102:   - Found 0 version(s) in /nix/store/2r7i28ndk02rpmvfkv2pzpj0n6zk78b3-dotnet-sdk-10.0.100-preview.7.25380.108/share/dotnet/library-packs [/build/source/src/LanguageServer/Microsoft.CodeAnalysis.LanguageServer/Microsoft.CodeAnalysis.LanguageServer.csproj]
/build/source/src/Compilers/CSharp/Portable/Microsoft.CodeAnalysis.CSharp.csproj : error NU1102: Unable to find package Microsoft.NETCore.App.Host.linux-arm64 with version (= 8.0.18) [/build/source/src/LanguageServer/Microsoft.CodeAnalysis.LanguageServer/Microsoft.CodeAnalysis.LanguageServer.csproj]
/build/source/src/Compilers/CSharp/Portable/Microsoft.CodeAnalysis.CSharp.csproj : error NU1102:   - Found 4 version(s) in _nix [ Nearest version: 8.0.19 ] [/build/source/src/LanguageServer/Microsoft.CodeAnalysis.LanguageServer/Microsoft.CodeAnalysis.LanguageServer.csproj]
/build/source/src/Compilers/CSharp/Portable/Microsoft.CodeAnalysis.CSharp.csproj : error NU1102:   - Found 0 version(s) in /nix/store/2r7i28ndk02rpmvfkv2pzpj0n6zk78b3-dotnet-sdk-10.0.100-preview.7.25380.108/share/dotnet/library-packs [/build/source/src/LanguageServer/Microsoft.CodeAnalysis.LanguageServer/Microsoft.CodeAnalysis.LanguageServer.csproj]
  Failed to restore /build/source/src/Compilers/Core/Portable/Microsoft.CodeAnalysis.csproj (in 56 ms).
  Failed to restore /build/source/src/Compilers/CSharp/Portable/Microsoft.CodeAnalysis.CSharp.csproj (in 45 ms).
  Failed to restore /build/source/src/Features/Core/Portable/Microsoft.CodeAnalysis.Features.csproj (in 80 ms).
  Failed to restore /build/source/src/Features/CSharp/Portable/Microsoft.CodeAnalysis.CSharp.Features.csproj (in 76 ms).

x86_64-darwin (sandbox = true)

❌ 4 packages failed to build:
  • dotnet-aspnetcore_10 (dotnetCorePackages.aspnetcore_10_0, dotnetCorePackages.aspnetcore_10_0-bin)
  • dotnet-runtime_10 (dotnetCorePackages.runtime_10_0, dotnetCorePackages.runtime_10_0-bin)
  • dotnet-sdk_10 (dotnetCorePackages.sdk_10_0, dotnetCorePackages.sdk_10_0-bin, dotnetCorePackages.sdk_10_0-source, dotnetCorePackages.sdk_10_0_1xx, dotnetCorePackages.sdk_10_0_1xx-bin)
  • roslyn-ls
✅ 1 package built:
  • dotnetCorePackages.generate-dotnet-sdk

aarch64-darwin (sandbox = true)

❌ 13 packages failed to build:
  • dotnet-aspnetcore_10 (dotnetCorePackages.aspnetcore_10_0, dotnetCorePackages.dotnet_10.aspnetcore)
  • dotnet-aspnetcore_10.man (dotnetCorePackages.aspnetcore_10_0.man, dotnetCorePackages.dotnet_10.aspnetcore.man)
  • dotnet-runtime_10 (dotnetCorePackages.dotnet_10.runtime, dotnetCorePackages.runtime_10_0)
  • dotnet-runtime_10.man (dotnetCorePackages.dotnet_10.runtime.man, dotnetCorePackages.runtime_10_0.man)
  • dotnet-sdk_10 (dotnetCorePackages.dotnet_10.sdk, dotnetCorePackages.sdk_10_0, dotnetCorePackages.sdk_10_0-source, dotnetCorePackages.sdk_10_0_1xx)
  • dotnet-sdk_10.man (dotnetCorePackages.dotnet_10.sdk.man, dotnetCorePackages.sdk_10_0-source.man, dotnetCorePackages.sdk_10_0.man, dotnetCorePackages.sdk_10_0_1xx.man)
  • dotnetCorePackages.aspnetcore_10_0-bin
  • dotnetCorePackages.dotnet_10.vmr
  • dotnetCorePackages.dotnet_10.vmr.man
  • dotnetCorePackages.generate-dotnet-sdk
  • dotnetCorePackages.runtime_10_0-bin
  • dotnetCorePackages.sdk_10_0-bin (dotnetCorePackages.sdk_10_0_1xx-bin)
  • roslyn-ls

@corngood
Copy link
Contributor Author

@GGG-KILLER I think those darwin failures might just be:

2025-08-19T14:58:32.6146110Z error: derivation '/nix/store/i8mzjxcaadlwcfppcrjx2j19lqmqxdq3-aspnetcore-runtime-10.0.0-preview.7.25380.108.drv' specifies a sandbox profile, but this is only allowed when 'sandbox' is 'relaxed'

?

@corngood
Copy link
Contributor Author

I'm working on roslyn-ls. I'm hoping to find a general solution for KnownFrameworkReference / KnownAppHostPack when using combinePackages.

@GGG-KILLER
Copy link
Contributor

@GGG-KILLER I think those darwin failures might just be:

2025-08-19T14:58:32.6146110Z error: derivation '/nix/store/i8mzjxcaadlwcfppcrjx2j19lqmqxdq3-aspnetcore-runtime-10.0.0-preview.7.25380.108.drv' specifies a sandbox profile, but this is only allowed when 'sandbox' is 'relaxed'

?

Lemme test with relaxed sandbox. Or would no sandbox be better?

@corngood
Copy link
Contributor Author

Lemme test with relaxed sandbox. Or would no sandbox be better?

Relaxed is fine for this stuff

@GGG-KILLER
Copy link
Contributor

nixpkgs-review result

Generated using nixpkgs-review-gha

Command: nixpkgs-review pr 433244
Commit: 954b774bb5eba412f1e930f9501721b866fab58b (subsequent changes)
Merge: 4323c620ecbdbf2424df7fd72e26b12c3368aa55

Logs: https://github.com/GGG-KILLER/nixpkgs-review-gha/actions/runs/17079234115


x86_64-darwin (sandbox = relaxed)

❌ 1 package failed to build:
  • roslyn-ls
✅ 4 packages built:
  • dotnet-aspnetcore_10 (dotnetCorePackages.aspnetcore_10_0, dotnetCorePackages.aspnetcore_10_0-bin)
  • dotnet-runtime_10 (dotnetCorePackages.runtime_10_0, dotnetCorePackages.runtime_10_0-bin)
  • dotnet-sdk_10 (dotnetCorePackages.sdk_10_0, dotnetCorePackages.sdk_10_0-bin, dotnetCorePackages.sdk_10_0-source, dotnetCorePackages.sdk_10_0_1xx, dotnetCorePackages.sdk_10_0_1xx-bin)
  • dotnetCorePackages.generate-dotnet-sdk

Error logs: `x86_64-darwin`
roslyn-ls
  Failed to restore /nix/build/nix-build-roslyn-ls-5.0.0-2.25371.17.drv-7407-955346434/source/src/Workspaces/Core/Portable/Microsoft.CodeAnalysis.Workspaces.csproj (in 206 ms).
  Failed to restore /nix/build/nix-build-roslyn-ls-5.0.0-2.25371.17.drv-7407-955346434/source/src/Tools/Source/CompilerGeneratorTools/Source/CSharpSyntaxGenerator/CSharpSyntaxGenerator.csproj (in 123 ms).
/nix/build/nix-build-roslyn-ls-5.0.0-2.25371.17.drv-7407-955346434/source/src/LanguageServer/ExternalAccess/VisualDiagnostics/Microsoft.CodeAnalysis.ExternalAccess.VisualDiagnostics.csproj : error NU1101: Unable to find package System.Diagnostics.Tracing. No packages exist with this id in source(s): _nix [/nix/build/nix-build-roslyn-ls-5.0.0-2.25371.17.drv-7407-955346434/source/src/LanguageServer/Microsoft.CodeAnalysis.LanguageServer/Microsoft.CodeAnalysis.LanguageServer.csproj]
/nix/build/nix-build-roslyn-ls-5.0.0-2.25371.17.drv-7407-955346434/source/src/LanguageServer/ExternalAccess/VisualDiagnostics/Microsoft.CodeAnalysis.ExternalAccess.VisualDiagnostics.csproj : error NU1101: Unable to find package System.Diagnostics.Process. No packages exist with this id in source(s): _nix [/nix/build/nix-build-roslyn-ls-5.0.0-2.25371.17.drv-7407-955346434/source/src/LanguageServer/Microsoft.CodeAnalysis.LanguageServer/Microsoft.CodeAnalysis.LanguageServer.csproj]
/nix/build/nix-build-roslyn-ls-5.0.0-2.25371.17.drv-7407-955346434/source/src/LanguageServer/ExternalAccess/VisualDiagnostics/Microsoft.CodeAnalysis.ExternalAccess.VisualDiagnostics.csproj : error NU1101: Unable to find package System.Diagnostics.TraceSource. No packages exist with this id in source(s): _nix [/nix/build/nix-build-roslyn-ls-5.0.0-2.25371.17.drv-7407-955346434/source/src/LanguageServer/Microsoft.CodeAnalysis.LanguageServer/Microsoft.CodeAnalysis.LanguageServer.csproj]
/nix/build/nix-build-roslyn-ls-5.0.0-2.25371.17.drv-7407-955346434/source/src/LanguageServer/ExternalAccess/VisualDiagnostics/Microsoft.CodeAnalysis.ExternalAccess.VisualDiagnostics.csproj : error NU1101: Unable to find package System.IO.Pipes. No packages exist with this id in source(s): _nix [/nix/build/nix-build-roslyn-ls-5.0.0-2.25371.17.drv-7407-955346434/source/src/LanguageServer/Microsoft.CodeAnalysis.LanguageServer/Microsoft.CodeAnalysis.LanguageServer.csproj]
  Restored /nix/build/nix-build-roslyn-ls-5.0.0-2.25371.17.drv-7407-955346434/source/src/Tools/ExternalAccess/Xaml/Microsoft.CodeAnalysis.ExternalAccess.Xaml.csproj (in 71 ms).
/nix/build/nix-build-roslyn-ls-5.0.0-2.25371.17.drv-7407-955346434/source/src/LanguageServer/Microsoft.CodeAnalysis.LanguageServer/Microsoft.CodeAnalysis.LanguageServer.csproj : error NU1102: Unable to find package Microsoft.NETCore.App.Ref with version (= 9.0.7)
/nix/build/nix-build-roslyn-ls-5.0.0-2.25371.17.drv-7407-955346434/source/src/LanguageServer/Microsoft.CodeAnalysis.LanguageServer/Microsoft.CodeAnalysis.LanguageServer.csproj : error NU1102:   - Found 4 version(s) in _nix [ Nearest version: 9.0.8 ]
/nix/build/nix-build-roslyn-ls-5.0.0-2.25371.17.drv-7407-955346434/source/src/LanguageServer/Microsoft.CodeAnalysis.LanguageServer/Microsoft.CodeAnalysis.LanguageServer.csproj : error NU1102: Unable to find package Microsoft.NETCore.App.Runtime.osx-x64 with version (= 9.0.7)
/nix/build/nix-build-roslyn-ls-5.0.0-2.25371.17.drv-7407-955346434/source/src/LanguageServer/Microsoft.CodeAnalysis.LanguageServer/Microsoft.CodeAnalysis.LanguageServer.csproj : error NU1102:   - Found 4 version(s) in _nix [ Nearest version: 9.0.8 ]
/nix/build/nix-build-roslyn-ls-5.0.0-2.25371.17.drv-7407-955346434/source/src/LanguageServer/Microsoft.CodeAnalysis.LanguageServer/Microsoft.CodeAnalysis.LanguageServer.csproj : error NU1102: Unable to find package Microsoft.AspNetCore.App.Ref with version (= 9.0.7)
/nix/build/nix-build-roslyn-ls-5.0.0-2.25371.17.drv-7407-955346434/source/src/LanguageServer/Microsoft.CodeAnalysis.LanguageServer/Microsoft.CodeAnalysis.LanguageServer.csproj : error NU1102:   - Found 4 version(s) in _nix [ Nearest version: 9.0.8 ]
/nix/build/nix-build-roslyn-ls-5.0.0-2.25371.17.drv-7407-955346434/source/src/LanguageServer/Microsoft.CodeAnalysis.LanguageServer/Microsoft.CodeAnalysis.LanguageServer.csproj : error NU1102: Unable to find package Microsoft.AspNetCore.App.Runtime.osx-x64 with version (= 9.0.7)
/nix/build/nix-build-roslyn-ls-5.0.0-2.25371.17.drv-7407-955346434/source/src/LanguageServer/Microsoft.CodeAnalysis.LanguageServer/Microsoft.CodeAnalysis.LanguageServer.csproj : error NU1102:   - Found 4 version(s) in _nix [ Nearest version: 9.0.8 ]
/nix/build/nix-build-roslyn-ls-5.0.0-2.25371.17.drv-7407-955346434/source/src/LanguageServer/Microsoft.CodeAnalysis.LanguageServer/Microsoft.CodeAnalysis.LanguageServer.csproj : error NU1102: Unable to find package Microsoft.NETCore.App.Host.osx-x64 with version (= 9.0.7)
/nix/build/nix-build-roslyn-ls-5.0.0-2.25371.17.drv-7407-955346434/source/src/LanguageServer/Microsoft.CodeAnalysis.LanguageServer/Microsoft.CodeAnalysis.LanguageServer.csproj : error NU1102:   - Found 4 version(s) in _nix [ Nearest version: 9.0.8 ]
  Failed to restore /nix/build/nix-build-roslyn-ls-5.0.0-2.25371.17.drv-7407-955346434/source/src/LanguageServer/ExternalAccess/VisualDiagnostics/Microsoft.CodeAnalysis.ExternalAccess.VisualDiagnostics.csproj (in 80 ms).
  Restored /nix/build/nix-build-roslyn-ls-5.0.0-2.25371.17.drv-7407-955346434/source/src/LanguageServer/ExternalAccess/Copilot/Microsoft.CodeAnalysis.LanguageServer.ExternalAccess.Copilot.csproj (in 105 ms).
  Failed to restore /nix/build/nix-build-roslyn-ls-5.0.0-2.25371.17.drv-7407-955346434/source/src/LanguageServer/Microsoft.CodeAnalysis.LanguageServer/Microsoft.CodeAnalysis.LanguageServer.csproj (in 244 ms).

aarch64-darwin (sandbox = relaxed)

❌ 9 packages failed to build:
  • dotnet-aspnetcore_10 (dotnetCorePackages.aspnetcore_10_0, dotnetCorePackages.dotnet_10.aspnetcore)
  • dotnet-aspnetcore_10.man (dotnetCorePackages.aspnetcore_10_0.man, dotnetCorePackages.dotnet_10.aspnetcore.man)
  • dotnet-runtime_10 (dotnetCorePackages.dotnet_10.runtime, dotnetCorePackages.runtime_10_0)
  • dotnet-runtime_10.man (dotnetCorePackages.dotnet_10.runtime.man, dotnetCorePackages.runtime_10_0.man)
  • dotnet-sdk_10 (dotnetCorePackages.dotnet_10.sdk, dotnetCorePackages.sdk_10_0, dotnetCorePackages.sdk_10_0-source, dotnetCorePackages.sdk_10_0_1xx)
  • dotnet-sdk_10.man (dotnetCorePackages.dotnet_10.sdk.man, dotnetCorePackages.sdk_10_0-source.man, dotnetCorePackages.sdk_10_0.man, dotnetCorePackages.sdk_10_0_1xx.man)
  • dotnetCorePackages.dotnet_10.vmr
  • dotnetCorePackages.dotnet_10.vmr.man
  • roslyn-ls
✅ 4 packages built:
  • dotnetCorePackages.aspnetcore_10_0-bin
  • dotnetCorePackages.generate-dotnet-sdk
  • dotnetCorePackages.runtime_10_0-bin
  • dotnetCorePackages.sdk_10_0-bin (dotnetCorePackages.sdk_10_0_1xx-bin)

@GGG-KILLER
Copy link
Contributor

It seems that SDK failed on the restore stage:

dotnet-stage0-vmr>   /nix/build/nix-build-dotnet-stage0-vmr-10.0.0-preview.7.drv-4823-3598222530/dotnet-10.0.100-preview.7.25380.108/src/source-build-reference-packages/src/externalPackages/projects/MSBuildLocator.proj(20,5): error MSB3073: The command "/nix/build/nix-build-dotnet-stage0-vmr-10.0.0-preview.7.drv-4823-3598222530/dotnet-10.0.100-preview.7.25380.108/.dotnet/dotnet restore /bl:/nix/build/nix-build-dotnet-stage0-vmr-10.0.0-preview.7.drv-4823-3598222530/dotnet-10.0.100-preview.7.25380.108/src/source-build-reference-packages/artifacts/log/Release/MSBuildLocator/restore.binlog /nix/build/nix-build-dotnet-stage0-vmr-10.0.0-preview.7.drv-4823-3598222530/dotnet-10.0.100-preview.7.25380.108/src/source-build-reference-packages/src/externalPackages/src/MSBuildLocator/artifacts/clone/src/MSBuildLocator/Microsoft.Build.Locator.csproj /p:Configuration=Release /v:minimal > /nix/build/nix-build-dotnet-stage0-vmr-10.0.0-preview.7.drv-4823-3598222530/dotnet-10.0.100-preview.7.25380.108/src/source-build-reference-packages/artifacts/log/Release/MSBuildLocator/MSBuildLocator.log 2>&1 /p:DelaySign=false /p:PublicSign=true /p:EnablePackageValidation=false /p:Version=1.6.10" exited with code 1.

However I cannot find any associated error messages or any more info on why it failed.

@corngood
Copy link
Contributor Author

However I cannot find any associated error messages or any more info on why it failed.

Is it this?

2025-08-19T19:47:12.0493940Z dotnet-stage0-vmr>       Determining projects to restore...
2025-08-19T19:47:12.0495460Z dotnet-stage0-vmr>     /nix/build/nix-build-dotnet-stage0-vmr-10.0.0-preview.7.drv-4823-3598222530/dotnet-10.0.100-preview.7.25380.108/.dotnet/sdk/10.0.100-preview.7.25380.108/NuGet.RestoreEx.targets(19,5): error : CSSM_ModuleLoad(): CSSMERR_DL_MDS_ERROR [/nix/build/nix-build-dotnet-stage0-vmr-10.0.0-preview.7.drv-4823-3598222530/dotnet-10.0.100-preview.7.25380.108/src/source-build-reference-packages/src/externalPackages/src/MSBuildLocator/artifacts/clone/src/MSBuildLocator/Microsoft.Build.Locator.csproj]
2025-08-19T19:47:12.0500990Z dotnet-stage0-vmr>       Restored /nix/build/nix-build-dotnet-stage0-vmr-10.0.0-preview.7.drv-4823-3598222530/dotnet-10.0.100-preview.7.25380.108/src/source-build-reference-packages/src/externalPackages/src/MSBuildLocator/artifacts/clone/src/MSBuildLocator/Microsoft.Build.Locator.csproj (in 569 ms).
2025-08-19T19:47:12.0504360Z dotnet-stage0-vmr> 
2025-08-19T19:47:12.0513330Z dotnet-stage0-vmr>     Build FAILED.
2025-08-19T19:47:12.0521950Z dotnet-stage0-vmr> 
2025-08-19T19:47:12.0538350Z dotnet-stage0-vmr>     /nix/build/nix-build-dotnet-stage0-vmr-10.0.0-preview.7.drv-4823-3598222530/dotnet-10.0.100-preview.7.25380.108/.dotnet/sdk/10.0.100-preview.7.25380.108/NuGet.RestoreEx.targets(19,5): error : CSSM_ModuleLoad(): CSSMERR_DL_MDS_ERROR [/nix/build/nix-build-dotnet-stage0-vmr-10.0.0-preview.7.drv-4823-3598222530/dotnet-10.0.100-preview.7.25380.108/src/source-build-reference-packages/src/externalPackages/src/MSBuildLocator/artifacts/clone/src/MSBuildLocator/Microsoft.Build.Locator.csproj]
2025-08-19T19:47:12.0553520Z dotnet-stage0-vmr>         0 Warning(s)
2025-08-19T19:47:12.0655170Z dotnet-stage0-vmr>         1 Error(s)
2025-08-19T19:47:12.0661580Z dotnet-stage0-vmr> 
2025-08-19T19:47:12.0733570Z dotnet-stage0-vmr>     Time Elapsed 00:00:04.61
2025-08-19T19:47:12.0734870Z dotnet-stage0-vmr> 
2025-08-19T19:47:12.0736180Z dotnet-stage0-vmr>     'MSBuildLocator' failed during build.

This looks like a sandbox thing:

error : CSSM_ModuleLoad(): CSSMERR_DL_MDS_ERROR

I can't seem to reproduce it, so maybe it's OS dependent? I wonder if GHA will build even the existing VMR.

@corngood
Copy link
Contributor Author

#435341 - roslyn-ls fix

@corngood corngood marked this pull request as ready for review August 21, 2025 14:53
@nixpkgs-ci nixpkgs-ci bot added the 9.needs: reviewer This PR currently has no reviewers requested and needs attention. label Aug 21, 2025
@nixpkgs-ci nixpkgs-ci bot added 12.approvals: 1 This PR was reviewed and approved by one person. and removed 9.needs: reviewer This PR currently has no reviewers requested and needs attention. labels Aug 21, 2025
@GGG-KILLER
Copy link
Contributor

nixpkgs-review result

Generated using nixpkgs-review-gha

Command: nixpkgs-review pr 433244
Commit: 954b774bb5eba412f1e930f9501721b866fab58b (subsequent changes)
Merge: e7b0737ae42c1fe5a2bebd0d91467a84e960a83c

Logs: https://github.com/GGG-KILLER/nixpkgs-review-gha/actions/runs/17137392043


x86_64-darwin (sandbox = false)

❌ 1 package failed to build:
  • roslyn-ls
✅ 4 packages built:
  • dotnet-aspnetcore_10 (dotnetCorePackages.aspnetcore_10_0, dotnetCorePackages.aspnetcore_10_0-bin)
  • dotnet-runtime_10 (dotnetCorePackages.runtime_10_0, dotnetCorePackages.runtime_10_0-bin)
  • dotnet-sdk_10 (dotnetCorePackages.sdk_10_0, dotnetCorePackages.sdk_10_0-bin, dotnetCorePackages.sdk_10_0-source, dotnetCorePackages.sdk_10_0_1xx, dotnetCorePackages.sdk_10_0_1xx-bin)
  • dotnetCorePackages.generate-dotnet-sdk

Error logs: `x86_64-darwin`
roslyn-ls
  Failed to restore /nix/build/nix-build-roslyn-ls-5.0.0-2.25371.17.drv-7576-291228281/source/src/Tools/Source/CompilerGeneratorTools/Source/CSharpSyntaxGenerator/CSharpSyntaxGenerator.csproj (in 222 ms).
  Failed to restore /nix/build/nix-build-roslyn-ls-5.0.0-2.25371.17.drv-7576-291228281/source/src/Workspaces/Core/Portable/Microsoft.CodeAnalysis.Workspaces.csproj (in 332 ms).
/nix/build/nix-build-roslyn-ls-5.0.0-2.25371.17.drv-7576-291228281/source/src/LanguageServer/ExternalAccess/VisualDiagnostics/Microsoft.CodeAnalysis.ExternalAccess.VisualDiagnostics.csproj : error NU1101: Unable to find package System.Diagnostics.Tracing. No packages exist with this id in source(s): _nix [/nix/build/nix-build-roslyn-ls-5.0.0-2.25371.17.drv-7576-291228281/source/src/LanguageServer/Microsoft.CodeAnalysis.LanguageServer/Microsoft.CodeAnalysis.LanguageServer.csproj]
/nix/build/nix-build-roslyn-ls-5.0.0-2.25371.17.drv-7576-291228281/source/src/LanguageServer/ExternalAccess/VisualDiagnostics/Microsoft.CodeAnalysis.ExternalAccess.VisualDiagnostics.csproj : error NU1101: Unable to find package System.Diagnostics.Process. No packages exist with this id in source(s): _nix [/nix/build/nix-build-roslyn-ls-5.0.0-2.25371.17.drv-7576-291228281/source/src/LanguageServer/Microsoft.CodeAnalysis.LanguageServer/Microsoft.CodeAnalysis.LanguageServer.csproj]
/nix/build/nix-build-roslyn-ls-5.0.0-2.25371.17.drv-7576-291228281/source/src/LanguageServer/ExternalAccess/VisualDiagnostics/Microsoft.CodeAnalysis.ExternalAccess.VisualDiagnostics.csproj : error NU1101: Unable to find package System.Diagnostics.TraceSource. No packages exist with this id in source(s): _nix [/nix/build/nix-build-roslyn-ls-5.0.0-2.25371.17.drv-7576-291228281/source/src/LanguageServer/Microsoft.CodeAnalysis.LanguageServer/Microsoft.CodeAnalysis.LanguageServer.csproj]
/nix/build/nix-build-roslyn-ls-5.0.0-2.25371.17.drv-7576-291228281/source/src/LanguageServer/ExternalAccess/VisualDiagnostics/Microsoft.CodeAnalysis.ExternalAccess.VisualDiagnostics.csproj : error NU1101: Unable to find package System.IO.Pipes. No packages exist with this id in source(s): _nix [/nix/build/nix-build-roslyn-ls-5.0.0-2.25371.17.drv-7576-291228281/source/src/LanguageServer/Microsoft.CodeAnalysis.LanguageServer/Microsoft.CodeAnalysis.LanguageServer.csproj]
  Restored /nix/build/nix-build-roslyn-ls-5.0.0-2.25371.17.drv-7576-291228281/source/src/Tools/ExternalAccess/Xaml/Microsoft.CodeAnalysis.ExternalAccess.Xaml.csproj (in 112 ms).
/nix/build/nix-build-roslyn-ls-5.0.0-2.25371.17.drv-7576-291228281/source/src/LanguageServer/Microsoft.CodeAnalysis.LanguageServer/Microsoft.CodeAnalysis.LanguageServer.csproj : error NU1102: Unable to find package Microsoft.NETCore.App.Ref with version (= 9.0.7)
/nix/build/nix-build-roslyn-ls-5.0.0-2.25371.17.drv-7576-291228281/source/src/LanguageServer/Microsoft.CodeAnalysis.LanguageServer/Microsoft.CodeAnalysis.LanguageServer.csproj : error NU1102:   - Found 4 version(s) in _nix [ Nearest version: 9.0.8 ]
/nix/build/nix-build-roslyn-ls-5.0.0-2.25371.17.drv-7576-291228281/source/src/LanguageServer/Microsoft.CodeAnalysis.LanguageServer/Microsoft.CodeAnalysis.LanguageServer.csproj : error NU1102: Unable to find package Microsoft.NETCore.App.Runtime.osx-x64 with version (= 9.0.7)
/nix/build/nix-build-roslyn-ls-5.0.0-2.25371.17.drv-7576-291228281/source/src/LanguageServer/Microsoft.CodeAnalysis.LanguageServer/Microsoft.CodeAnalysis.LanguageServer.csproj : error NU1102:   - Found 4 version(s) in _nix [ Nearest version: 9.0.8 ]
/nix/build/nix-build-roslyn-ls-5.0.0-2.25371.17.drv-7576-291228281/source/src/LanguageServer/Microsoft.CodeAnalysis.LanguageServer/Microsoft.CodeAnalysis.LanguageServer.csproj : error NU1102: Unable to find package Microsoft.AspNetCore.App.Ref with version (= 9.0.7)
/nix/build/nix-build-roslyn-ls-5.0.0-2.25371.17.drv-7576-291228281/source/src/LanguageServer/Microsoft.CodeAnalysis.LanguageServer/Microsoft.CodeAnalysis.LanguageServer.csproj : error NU1102:   - Found 4 version(s) in _nix [ Nearest version: 9.0.8 ]
/nix/build/nix-build-roslyn-ls-5.0.0-2.25371.17.drv-7576-291228281/source/src/LanguageServer/Microsoft.CodeAnalysis.LanguageServer/Microsoft.CodeAnalysis.LanguageServer.csproj : error NU1102: Unable to find package Microsoft.AspNetCore.App.Runtime.osx-x64 with version (= 9.0.7)
/nix/build/nix-build-roslyn-ls-5.0.0-2.25371.17.drv-7576-291228281/source/src/LanguageServer/Microsoft.CodeAnalysis.LanguageServer/Microsoft.CodeAnalysis.LanguageServer.csproj : error NU1102:   - Found 4 version(s) in _nix [ Nearest version: 9.0.8 ]
/nix/build/nix-build-roslyn-ls-5.0.0-2.25371.17.drv-7576-291228281/source/src/LanguageServer/Microsoft.CodeAnalysis.LanguageServer/Microsoft.CodeAnalysis.LanguageServer.csproj : error NU1102: Unable to find package Microsoft.NETCore.App.Host.osx-x64 with version (= 9.0.7)
/nix/build/nix-build-roslyn-ls-5.0.0-2.25371.17.drv-7576-291228281/source/src/LanguageServer/Microsoft.CodeAnalysis.LanguageServer/Microsoft.CodeAnalysis.LanguageServer.csproj : error NU1102:   - Found 4 version(s) in _nix [ Nearest version: 9.0.8 ]
  Failed to restore /nix/build/nix-build-roslyn-ls-5.0.0-2.25371.17.drv-7576-291228281/source/src/LanguageServer/ExternalAccess/VisualDiagnostics/Microsoft.CodeAnalysis.ExternalAccess.VisualDiagnostics.csproj (in 103 ms).
  Restored /nix/build/nix-build-roslyn-ls-5.0.0-2.25371.17.drv-7576-291228281/source/src/LanguageServer/ExternalAccess/Copilot/Microsoft.CodeAnalysis.LanguageServer.ExternalAccess.Copilot.csproj (in 67 ms).
  Failed to restore /nix/build/nix-build-roslyn-ls-5.0.0-2.25371.17.drv-7576-291228281/source/src/LanguageServer/Microsoft.CodeAnalysis.LanguageServer/Microsoft.CodeAnalysis.LanguageServer.csproj (in 363 ms).

aarch64-darwin (sandbox = false)

❌ 1 package failed to build:
  • roslyn-ls
✅ 12 packages built:
  • dotnet-aspnetcore_10 (dotnetCorePackages.aspnetcore_10_0, dotnetCorePackages.dotnet_10.aspnetcore)
  • dotnet-aspnetcore_10.man (dotnetCorePackages.aspnetcore_10_0.man, dotnetCorePackages.dotnet_10.aspnetcore.man)
  • dotnet-runtime_10 (dotnetCorePackages.dotnet_10.runtime, dotnetCorePackages.runtime_10_0)
  • dotnet-runtime_10.man (dotnetCorePackages.dotnet_10.runtime.man, dotnetCorePackages.runtime_10_0.man)
  • dotnet-sdk_10 (dotnetCorePackages.dotnet_10.sdk, dotnetCorePackages.sdk_10_0, dotnetCorePackages.sdk_10_0-source, dotnetCorePackages.sdk_10_0_1xx)
  • dotnet-sdk_10.man (dotnetCorePackages.dotnet_10.sdk.man, dotnetCorePackages.sdk_10_0-source.man, dotnetCorePackages.sdk_10_0.man, dotnetCorePackages.sdk_10_0_1xx.man)
  • dotnetCorePackages.aspnetcore_10_0-bin
  • dotnetCorePackages.dotnet_10.vmr
  • dotnetCorePackages.dotnet_10.vmr.man
  • dotnetCorePackages.generate-dotnet-sdk
  • dotnetCorePackages.runtime_10_0-bin
  • dotnetCorePackages.sdk_10_0-bin (dotnetCorePackages.sdk_10_0_1xx-bin)

Error logs: `aarch64-darwin`
roslyn-ls
  Failed to restore /nix/build/nix-build-roslyn-ls-5.0.0-2.25371.17.drv-5317-1740309466/source/src/Workspaces/MSBuild/Core/Microsoft.CodeAnalysis.Workspaces.MSBuild.csproj (in 60 ms).
/nix/build/nix-build-roslyn-ls-5.0.0-2.25371.17.drv-5317-1740309466/source/src/Tools/Source/CompilerGeneratorTools/Source/CSharpSyntaxGenerator/CSharpSyntaxGenerator.csproj : error NU1102: Unable to find package Microsoft.NETCore.App.Ref with version (= 9.0.7) [/nix/build/nix-build-roslyn-ls-5.0.0-2.25371.17.drv-5317-1740309466/source/src/LanguageServer/Microsoft.CodeAnalysis.LanguageServer/Microsoft.CodeAnalysis.LanguageServer.csproj]
/nix/build/nix-build-roslyn-ls-5.0.0-2.25371.17.drv-5317-1740309466/source/src/Tools/Source/CompilerGeneratorTools/Source/CSharpSyntaxGenerator/CSharpSyntaxGenerator.csproj : error NU1102:   - Found 4 version(s) in _nix [ Nearest version: 9.0.8 ] [/nix/build/nix-build-roslyn-ls-5.0.0-2.25371.17.drv-5317-1740309466/source/src/LanguageServer/Microsoft.CodeAnalysis.LanguageServer/Microsoft.CodeAnalysis.LanguageServer.csproj]
/nix/build/nix-build-roslyn-ls-5.0.0-2.25371.17.drv-5317-1740309466/source/src/Tools/Source/CompilerGeneratorTools/Source/CSharpSyntaxGenerator/CSharpSyntaxGenerator.csproj : error NU1102:   - Found 0 version(s) in /nix/store/csnj88f0f00cxc45qc6yqnhx0gd0018b-dotnet-sdk-10.0.100-preview.7.25380.108/share/dotnet/library-packs [/nix/build/nix-build-roslyn-ls-5.0.0-2.25371.17.drv-5317-1740309466/source/src/LanguageServer/Microsoft.CodeAnalysis.LanguageServer/Microsoft.CodeAnalysis.LanguageServer.csproj]
/nix/build/nix-build-roslyn-ls-5.0.0-2.25371.17.drv-5317-1740309466/source/src/Tools/Source/CompilerGeneratorTools/Source/CSharpSyntaxGenerator/CSharpSyntaxGenerator.csproj : error NU1102: Unable to find package Microsoft.NETCore.App.Runtime.osx-arm64 with version (= 9.0.7) [/nix/build/nix-build-roslyn-ls-5.0.0-2.25371.17.drv-5317-1740309466/source/src/LanguageServer/Microsoft.CodeAnalysis.LanguageServer/Microsoft.CodeAnalysis.LanguageServer.csproj]
/nix/build/nix-build-roslyn-ls-5.0.0-2.25371.17.drv-5317-1740309466/source/src/Tools/Source/CompilerGeneratorTools/Source/CSharpSyntaxGenerator/CSharpSyntaxGenerator.csproj : error NU1102:   - Found 4 version(s) in _nix [ Nearest version: 9.0.8 ] [/nix/build/nix-build-roslyn-ls-5.0.0-2.25371.17.drv-5317-1740309466/source/src/LanguageServer/Microsoft.CodeAnalysis.LanguageServer/Microsoft.CodeAnalysis.LanguageServer.csproj]
/nix/build/nix-build-roslyn-ls-5.0.0-2.25371.17.drv-5317-1740309466/source/src/Tools/Source/CompilerGeneratorTools/Source/CSharpSyntaxGenerator/CSharpSyntaxGenerator.csproj : error NU1102:   - Found 0 version(s) in /nix/store/csnj88f0f00cxc45qc6yqnhx0gd0018b-dotnet-sdk-10.0.100-preview.7.25380.108/share/dotnet/library-packs [/nix/build/nix-build-roslyn-ls-5.0.0-2.25371.17.drv-5317-1740309466/source/src/LanguageServer/Microsoft.CodeAnalysis.LanguageServer/Microsoft.CodeAnalysis.LanguageServer.csproj]
/nix/build/nix-build-roslyn-ls-5.0.0-2.25371.17.drv-5317-1740309466/source/src/Tools/Source/CompilerGeneratorTools/Source/CSharpSyntaxGenerator/CSharpSyntaxGenerator.csproj : error NU1102: Unable to find package Microsoft.AspNetCore.App.Ref with version (= 9.0.7) [/nix/build/nix-build-roslyn-ls-5.0.0-2.25371.17.drv-5317-1740309466/source/src/LanguageServer/Microsoft.CodeAnalysis.LanguageServer/Microsoft.CodeAnalysis.LanguageServer.csproj]
/nix/build/nix-build-roslyn-ls-5.0.0-2.25371.17.drv-5317-1740309466/source/src/Tools/Source/CompilerGeneratorTools/Source/CSharpSyntaxGenerator/CSharpSyntaxGenerator.csproj : error NU1102:   - Found 4 version(s) in _nix [ Nearest version: 9.0.8 ] [/nix/build/nix-build-roslyn-ls-5.0.0-2.25371.17.drv-5317-1740309466/source/src/LanguageServer/Microsoft.CodeAnalysis.LanguageServer/Microsoft.CodeAnalysis.LanguageServer.csproj]
/nix/build/nix-build-roslyn-ls-5.0.0-2.25371.17.drv-5317-1740309466/source/src/Tools/Source/CompilerGeneratorTools/Source/CSharpSyntaxGenerator/CSharpSyntaxGenerator.csproj : error NU1102:   - Found 0 version(s) in /nix/store/csnj88f0f00cxc45qc6yqnhx0gd0018b-dotnet-sdk-10.0.100-preview.7.25380.108/share/dotnet/library-packs [/nix/build/nix-build-roslyn-ls-5.0.0-2.25371.17.drv-5317-1740309466/source/src/LanguageServer/Microsoft.CodeAnalysis.LanguageServer/Microsoft.CodeAnalysis.LanguageServer.csproj]
/nix/build/nix-build-roslyn-ls-5.0.0-2.25371.17.drv-5317-1740309466/source/src/Tools/Source/CompilerGeneratorTools/Source/CSharpSyntaxGenerator/CSharpSyntaxGenerator.csproj : error NU1102: Unable to find package Microsoft.AspNetCore.App.Runtime.osx-arm64 with version (= 9.0.7) [/nix/build/nix-build-roslyn-ls-5.0.0-2.25371.17.drv-5317-1740309466/source/src/LanguageServer/Microsoft.CodeAnalysis.LanguageServer/Microsoft.CodeAnalysis.LanguageServer.csproj]
/nix/build/nix-build-roslyn-ls-5.0.0-2.25371.17.drv-5317-1740309466/source/src/Tools/Source/CompilerGeneratorTools/Source/CSharpSyntaxGenerator/CSharpSyntaxGenerator.csproj : error NU1102:   - Found 4 version(s) in _nix [ Nearest version: 9.0.8 ] [/nix/build/nix-build-roslyn-ls-5.0.0-2.25371.17.drv-5317-1740309466/source/src/LanguageServer/Microsoft.CodeAnalysis.LanguageServer/Microsoft.CodeAnalysis.LanguageServer.csproj]
/nix/build/nix-build-roslyn-ls-5.0.0-2.25371.17.drv-5317-1740309466/source/src/Tools/Source/CompilerGeneratorTools/Source/CSharpSyntaxGenerator/CSharpSyntaxGenerator.csproj : error NU1102:   - Found 0 version(s) in /nix/store/csnj88f0f00cxc45qc6yqnhx0gd0018b-dotnet-sdk-10.0.100-preview.7.25380.108/share/dotnet/library-packs [/nix/build/nix-build-roslyn-ls-5.0.0-2.25371.17.drv-5317-1740309466/source/src/LanguageServer/Microsoft.CodeAnalysis.LanguageServer/Microsoft.CodeAnalysis.LanguageServer.csproj]
/nix/build/nix-build-roslyn-ls-5.0.0-2.25371.17.drv-5317-1740309466/source/src/Tools/Source/CompilerGeneratorTools/Source/CSharpSyntaxGenerator/CSharpSyntaxGenerator.csproj : error NU1102: Unable to find package Microsoft.NETCore.App.Host.osx-arm64 with version (= 9.0.7) [/nix/build/nix-build-roslyn-ls-5.0.0-2.25371.17.drv-5317-1740309466/source/src/LanguageServer/Microsoft.CodeAnalysis.LanguageServer/Microsoft.CodeAnalysis.LanguageServer.csproj]
/nix/build/nix-build-roslyn-ls-5.0.0-2.25371.17.drv-5317-1740309466/source/src/Tools/Source/CompilerGeneratorTools/Source/CSharpSyntaxGenerator/CSharpSyntaxGenerator.csproj : error NU1102:   - Found 4 version(s) in _nix [ Nearest version: 9.0.8 ] [/nix/build/nix-build-roslyn-ls-5.0.0-2.25371.17.drv-5317-1740309466/source/src/LanguageServer/Microsoft.CodeAnalysis.LanguageServer/Microsoft.CodeAnalysis.LanguageServer.csproj]
/nix/build/nix-build-roslyn-ls-5.0.0-2.25371.17.drv-5317-1740309466/source/src/Tools/Source/CompilerGeneratorTools/Source/CSharpSyntaxGenerator/CSharpSyntaxGenerator.csproj : error NU1102:   - Found 0 version(s) in /nix/store/csnj88f0f00cxc45qc6yqnhx0gd0018b-dotnet-sdk-10.0.100-preview.7.25380.108/share/dotnet/library-packs [/nix/build/nix-build-roslyn-ls-5.0.0-2.25371.17.drv-5317-1740309466/source/src/LanguageServer/Microsoft.CodeAnalysis.LanguageServer/Microsoft.CodeAnalysis.LanguageServer.csproj]
  Failed to restore /nix/build/nix-build-roslyn-ls-5.0.0-2.25371.17.drv-5317-1740309466/source/src/Workspaces/CSharp/Portable/Microsoft.CodeAnalysis.CSharp.Workspaces.csproj (in 34 ms).
  Failed to restore /nix/build/nix-build-roslyn-ls-5.0.0-2.25371.17.drv-5317-1740309466/source/src/Tools/Source/CompilerGeneratorTools/Source/CSharpSyntaxGenerator/CSharpSyntaxGenerator.csproj (in 34 ms).
  Failed to restore /nix/build/nix-build-roslyn-ls-5.0.0-2.25371.17.drv-5317-1740309466/source/src/Workspaces/Core/Portable/Microsoft.CodeAnalysis.Workspaces.csproj (in 47 ms).
  Restored /nix/build/nix-build-roslyn-ls-5.0.0-2.25371.17.drv-5317-1740309466/source/src/Tools/ExternalAccess/Xaml/Microsoft.CodeAnalysis.ExternalAccess.Xaml.csproj (in 26 ms).

@GGG-KILLER
Copy link
Contributor

Disabling the sandbox seems to have solved it

@corngood
Copy link
Contributor Author

corngood commented Aug 22, 2025

Maybe those sandbox profiles need to be updated to support other OS versions. The only builder I've tested on is running 15.6.1. You don't happen to know what yours is using?

@GGG-KILLER
Copy link
Contributor

Maybe those sandbox profiles need to be updated to support other OS versions. The only builder I've tested on is running 15.6.1. You don't happen to know what yours is using?

They seem to be on macOS 15.5:

Runner Image Provisioner
  Hosted Compute Agent
  Version: 20250818.377
  Commit: 3c593e9f75fe0b87e893bca80d6e12ba089c61fc
  Build Date: 2025-08-18T14:52:18Z
Operating System
  macOS
  15.5
  24F74
Runner Image
  Image: macos-15-arm64
  Version: 20250818.2206
  Included Software: https://github.com/actions/runner-images/blob/macos-15-arm64/20250818.2206/images/macos/macos-15-arm64-Readme.md
  Image Release: https://github.com/actions/runner-images/releases/tag/macos-15-arm64%2F20250818.2206

@corngood corngood merged commit 445f184 into NixOS:master Aug 24, 2025
53 of 57 checks passed
@corngood corngood added the backport release-25.05 Backport PR automatically label Aug 24, 2025
@nixpkgs-ci
Copy link
Contributor

nixpkgs-ci bot commented Aug 24, 2025

Successfully created backport PR for release-25.05:

@github-actions github-actions bot added the 8.has: port to stable This PR already has a backport to the stable release. label Aug 24, 2025
@corngood corngood deleted the dotnet-update branch August 25, 2025 13:23
Sign up for free to join this conversation on GitHub. Already have an account? Sign in to comment
Labels
6.topic: dotnet Language: .NET 8.has: port to stable This PR already has a backport to the stable release. 10.rebuild-darwin: 11-100 This PR causes between 11 and 100 packages to rebuild on Darwin. 10.rebuild-linux: 11-100 This PR causes between 11 and 100 packages to rebuild on Linux. 11.by: package-maintainer This PR was created by a maintainer of all the package it changes. 12.approvals: 1 This PR was reviewed and approved by one person. backport release-25.05 Backport PR automatically
Projects
None yet
Development

Successfully merging this pull request may close these issues.

2 participants